bots-garden/sidekickspublic Fork
⑂ main
Commits
⬇ Clone ▾
git clone https://git.rickub.com/bots-garden/sidekicks.git
git clone ssh://git@rickub.com/bots-garden/sidekicks.git

Host key fingerprint (ed25519): SHA256:iycHnxEyq0Q7uyVpB7JlznP0G7JrTPXLYRcAU5CSLhc — verify it before your first connect.

Download ZIP
failure

CI #5

push · feature/m2-chat · 51f931f9ran in 3m54s · 2989 lines of output
queued <1s ran 3m53s total 3m54s
1 jobs
1 failed
3m54s duration
— tests
0 artifacts
failurecheck → Lint and tests View log
Unclassified failure The failure didn't match a known signature. Open the log — and this is a signal our classifier needs a new pattern.
check
failurecheck 3m53s

Annotations

  • WARNING uploadCacheArchiveSDK: internal error uploading cache archive: upstream unavailable
  • WARNING Failed to save: upstream unavailable
successSet up job
cloning bots-garden/sidekicks @ 51f931f9a3cefc15089414b28eac1f6bea7e8c64action actions/setup-go@v5: node20 (_actions/actions/setup-go/v5)action actions/setup-node@v4: node20 (_actions/actions/setup-node/v4)
successCheckout 1s
(checkout already performed by the runner — delivered as the read-only work disk)
successSet up Go 6s
ciguest: network up (172.30.0.14/30 via 172.30.0.13)ciguest: starting dockerd (overlay2, data-root on scratch)ciguest: dockerd is readyciguest: loaded baked image postgres_16-alpine.tar.gz: Loaded image: postgres:16-alpineciguest: 1 baked image archive(s) loaded (no per-job registry pull needed)ciguest: logged into registry registry.rickub.com as rickubSetup go version spec 1.26.0isExplicit: 1.26.0explicit? truechecking cache: /tmp/hostedtoolcache/go/1.26.0/x64not foundAttempting to download 1.26.0...No manifest cachedGetting manifest from actions/go-versions@main(node:549) [DEP0040] DeprecationWarning: The `punycode` module is deprecated. Please use a userland alternative instead.(Use `node --trace-deprecation ...` to show where the warning was created)matching 1.26.0...check 1.27.3 satisfies 1.26.0check 1.27.2 satisfies 1.26.0check 1.27.1 satisfies 1.26.0check 1.27.0 satisfies 1.26.0check 1.26.10 satisfies 1.26.0check 1.26.9 satisfies 1.26.0check 1.26.8 satisfies 1.26.0check 1.26.7 satisfies 1.26.0check 1.26.6 satisfies 1.26.0check 1.26.5 satisfies 1.26.0check 1.26.4 satisfies 1.26.0check 1.26.3 satisfies 1.26.0check 1.26.2 satisfies 1.26.0check 1.26.1 satisfies 1.26.0check 1.26.0 satisfies 1.26.0arm64===x64 && darwin===linuxx64===x64 && darwin===linuxarm64===x64 && linux===linuxx64===x64 && linux===linuxmatched 1.26.0Acquiring 1.26.0 from https://github.com/actions/go-versions/releases/download/1.26.0-21889650668/go-1.26.0-linux-x64.tar.gzDownloading https://github.com/actions/go-versions/releases/download/1.26.0-21889650668/go-1.26.0-linux-x64.tar.gzDestination /tmp/5bacc008-c5e7-45d2-9837-5607b156f016download completeExtracting Go...Checking tar --versiontar (GNU tar) 1.34Copyright (C) 2021 Free Software Foundation, Inc.License GPLv3+: GNU GPL version 3 or later <https://gnu.org/licenses/gpl.html>.This is free software: you are free to change and redistribute it.There is NO WARRANTY, to the extent permitted by law.Written by John Gilmore and Jay Fenlason.[command]/usr/bin/tar xz --warning=no-unknown-keyword --overwrite -C /tmp/efb65cab-8bd4-4b15-8045-204c2ef51462 -f /tmp/5bacc008-c5e7-45d2-9837-5607b156f016Successfully extracted go to /tmp/efb65cab-8bd4-4b15-8045-204c2ef51462Adding to the cache ...Caching tool go 1.26.0 x64source dir: /tmp/efb65cab-8bd4-4b15-8045-204c2ef51462destination /tmp/hostedtoolcache/go/1.26.0/x64finished caching toolSuccessfully cached go to /tmp/hostedtoolcache/go/1.26.0/x64Added go to the pathSuccessfully set up Go version 1.26.0which go :/tmp/hostedtoolcache/go/1.26.0/x64/bin/go:go env GOPATH :/tmp/home/go:creating /tmp/home/gocreating /tmp/home/go/binadd bin true[command]/tmp/hostedtoolcache/go/1.26.0/x64/bin/go env GOMODCACHE[command]/tmp/hostedtoolcache/go/1.26.0/x64/bin/go env GOCACHE/tmp/home/go/pkg/mod/tmp/home/.cache/go-buildfollowSymbolicLinks 'true'followSymbolicLinks 'true'implicitDescendants 'true'matchDirectories 'true'omitBrokenSymbolicLinks 'true'excludeHiddenFiles 'false'Search path '/workspace/sidekicks/go.sum'/workspace/sidekicks/go.sumFound 1 files to hash.primary key is setup-go-Linux-x64-ubuntu22-go-1.26.0-46a386bcea71790c8004b90a9e93b7b38a7d92c2fce75a65fefe88aeec7331daCache service version: v2Resolved Keys:["setup-go-Linux-x64-ubuntu22-go-1.26.0-46a386bcea71790c8004b90a9e93b7b38a7d92c2fce75a65fefe88aeec7331da"]Checking zstd --quiet --version1.5.4zstd version: 1.5.4[Request] GetCacheEntryDownloadURL http://172.30.255.1:8888/twirp/github.actions.results.api.v1.CacheService/GetCacheEntryDownloadURL[Response] - 200Headers: { "content-length": "13", "content-security-policy": "default-src 'self'; img-src 'self' data:; style-src 'self'; script-src 'self'; base-uri 'none'; frame-ancestors 'none'; object-src 'none'; form-action 'self' https://payment.stancer.com", "content-type": "application/json", "date": "Thu, 29 Oct 2026 12:12:05 GMT", "permissions-policy": "accelerometer=(), autoplay=(), camera=(), display-capture=(), encrypted-media=(), fullscreen=(self), geolocation=(), gyroscope=(), magnetometer=(), microphone=(), midi=(), payment=(), usb=()", "referrer-policy": "strict-origin-when-cross-origin", "strict-transport-security": "max-age=31536000; includeSubDomains", "x-content-type-options": "nosniff", "x-request-id": "332c3d0e-483b-4672-82de-39431d9ea10a"}Body: { "ok": false}Cache not found for version 2ba34da42fb93060f8b28272c48240c4b76165e1c6289ee9dd2b884514a58d3d of keys: setup-go-Linux-x64-ubuntu22-go-1.26.0-46a386bcea71790c8004b90a9e93b7b38a7d92c2fce75a65fefe88aeec7331daCache is not found##[add-matcher]/workspace/_actions/actions/setup-go/v5/matchers.jsongo version go1.26.0 linux/amd64
go env
AR='ar'CC='gcc'CGO_CFLAGS='-O2 -g'CGO_CPPFLAGS=''CGO_CXXFLAGS='-O2 -g'CGO_ENABLED='1'CGO_FFLAGS='-O2 -g'CGO_LDFLAGS='-O2 -g'CXX='g++'GCCGO='gccgo'GO111MODULE=''GOAMD64='v1'GOARCH='amd64'GOAUTH='netrc'GOBIN=''GOCACHE='/tmp/home/.cache/go-build'GOCACHEPROG=''GODEBUG=''GOENV='/tmp/home/.config/go/env'GOEXE=''GOEXPERIMENT=''GOFIPS140='off'GOFLAGS=''GOGCCFLAGS='-fPIC -m64 -pthread -Wl,--no-gc-sections -fmessage-length=0 -ffile-prefix-map=/tmp/go-build1923662651=/tmp/go-build -gno-record-gcc-switches'GOHOSTARCH='amd64'GOHOSTOS='linux'GOINSECURE=''GOMOD='/workspace/sidekicks/go.mod'GOMODCACHE='/tmp/home/go/pkg/mod'GONOPROXY=''GONOSUMDB=''GOOS='linux'GOPATH='/tmp/home/go'GOPRIVATE=''GOPROXY='https://proxy.golang.org,direct'GOROOT='/tmp/hostedtoolcache/go/1.26.0/x64'GOSUMDB='sum.golang.org'GOTELEMETRY='local'GOTELEMETRYDIR='/tmp/home/.config/go/telemetry'GOTMPDIR=''GOTOOLCHAIN='auto'GOTOOLDIR='/tmp/hostedtoolcache/go/1.26.0/x64/pkg/tool/linux_amd64'GOVCS=''GOVERSION='go1.26.0'GOWORK=''PKG_CONFIG='pkg-config'
successSet up Node 2s
isExplicit: explicit? falseevaluating 0 versionsmatch not foundAttempting to download 22...No manifest cachedGetting manifest from actions/node-versions@main(node:617) [DEP0040] DeprecationWarning: The `punycode` module is deprecated. Please use a userland alternative instead.(Use `node --trace-deprecation ...` to show where the warning was created)check 26.12.1 satisfies 22check 26.12.0 satisfies 22check 26.11.1 satisfies 22check 26.11.0 satisfies 22check 26.10.0 satisfies 22check 26.9.0 satisfies 22check 26.8.2 satisfies 22check 26.8.1 satisfies 22check 26.8.0 satisfies 22check 26.7.0 satisfies 22check 26.6.0 satisfies 22check 26.5.1 satisfies 22check 26.5.0 satisfies 22check 26.4.0 satisfies 22check 26.3.1 satisfies 22check 26.3.0 satisfies 22check 26.2.0 satisfies 22check 26.1.0 satisfies 22check 26.0.0 satisfies 22check 24.22.1 satisfies 22check 24.22.0 satisfies 22check 24.21.0 satisfies 22check 24.20.0 satisfies 22check 24.19.0 satisfies 22check 24.18.1 satisfies 22check 24.18.0 satisfies 22check 24.17.0 satisfies 22check 24.16.0 satisfies 22check 24.15.0 satisfies 22check 24.14.1 satisfies 22check 24.14.0 satisfies 22check 24.13.1 satisfies 22check 24.13.0 satisfies 22check 24.12.0 satisfies 22check 24.11.1 satisfies 22check 24.11.0 satisfies 22check 24.10.0 satisfies 22check 24.9.0 satisfies 22check 24.8.0 satisfies 22check 24.7.0 satisfies 22check 24.6.0 satisfies 22check 24.5.0 satisfies 22check 24.4.1 satisfies 22check 24.4.0 satisfies 22check 24.3.0 satisfies 22check 24.2.0 satisfies 22check 24.1.0 satisfies 22check 24.0.2 satisfies 22check 24.0.1 satisfies 22check 24.0.0 satisfies 22check 22.23.4 satisfies 22arm64===x64 && darwin===linuxx64===x64 && darwin===linuxarm64===x64 && linux===linuxx64===x64 && linux===linuxmatched 22.23.4Acquiring 22.23.4 - x64 from https://github.com/actions/node-versions/releases/download/22.23.4-39619033003/node-22.23.4-linux-x64.tar.gzDownloading https://github.com/actions/node-versions/releases/download/22.23.4-39619033003/node-22.23.4-linux-x64.tar.gzDestination /tmp/e6d4b490-ab81-4afd-b4e2-cd867c11f515download completeExtracting ...Checking tar --versiontar (GNU tar) 1.34Copyright (C) 2021 Free Software Foundation, Inc.License GPLv3+: GNU GPL version 3 or later <https://gnu.org/licenses/gpl.html>.This is free software: you are free to change and redistribute it.There is NO WARRANTY, to the extent permitted by law.Written by John Gilmore and Jay Fenlason.[command]/usr/bin/tar xz --strip 1 --warning=no-unknown-keyword --overwrite -C /tmp/d2aa574d-24fb-415c-a3f9-4c71aac36a54 -f /tmp/e6d4b490-ab81-4afd-b4e2-cd867c11f515Adding to the cache ...Caching tool node 22.23.4 x64source dir: /tmp/d2aa574d-24fb-415c-a3f9-4c71aac36a54destination /tmp/hostedtoolcache/node/22.23.4/x64finished caching tool
Environment details
node: v22.23.4npm: 10.9.9yarn:
##[add-matcher]/workspace/_actions/actions/setup-node/v4/.github/tsc.json##[add-matcher]/workspace/_actions/actions/setup-node/v4/.github/eslint-stylish.json##[add-matcher]/workspace/_actions/actions/setup-node/v4/.github/eslint-compact.json
successInstall pnpm (version from frontend/package.json) 2s
Run
npm install -g "$(node -p "require('./frontend/package.json').packageManager")"
added 2 packages in 2s
successInstall the Wails build dependencies (GTK 4, WebKitGTK 6) 27s
Run
sudo apt-get update -qq
sudo apt-get install -y -qq pkg-config libgtk-4-dev libwebkitgtk-6.0-dev
debconf: delaying package configuration, since apt-utils is not installedSelecting previously unselected package libargon2-1:amd64.(Reading database ... (Reading database ... 5% (Reading database ... 10% (Reading database ... 15% (Reading database ... 20% (Reading database ... 25% (Reading database ... 30% (Reading database ... 35% (Reading database ... 40% (Reading database ... 45% (Reading database ... 50% (Reading database ... 55% (Reading database ... 60% (Reading database ... 65% (Reading database ... 70% (Reading database ... 75% (Reading database ... 80% (Reading database ... 85% (Reading database ... 90% (Reading database ... 95% (Reading database ... 100% (Reading database ... 17102 files and directories currently installed.)Preparing to unpack .../0-libargon2-1_0~20171227-0.3+deb12u1_amd64.deb ...Unpacking libargon2-1:amd64 (0~20171227-0.3+deb12u1) ...Selecting previously unselected package dmsetup.Preparing to unpack .../1-dmsetup_2%3a1.02.185-2_amd64.deb ...Unpacking dmsetup (2:1.02.185-2) ...Selecting previously unselected package libdevmapper1.02.1:amd64.Preparing to unpack .../2-libdevmapper1.02.1_2%3a1.02.185-2_amd64.deb ...Unpacking libdevmapper1.02.1:amd64 (2:1.02.185-2) ...Selecting previously unselected package libjson-c5:amd64.Preparing to unpack .../3-libjson-c5_0.16-2_amd64.deb ...Unpacking libjson-c5:amd64 (0.16-2) ...Selecting previously unselected package libcryptsetup12:amd64.Preparing to unpack .../4-libcryptsetup12_2%3a2.6.1-4~deb12u2_amd64.deb ...Unpacking libcryptsetup12:amd64 (2:2.6.1-4~deb12u2) ...Selecting previously unselected package libfdisk1:amd64.Preparing to unpack .../5-libfdisk1_2.38.1-5+deb12u3_amd64.deb ...Unpacking libfdisk1:amd64 (2.38.1-5+deb12u3) ...Selecting previously unselected package libapparmor1:amd64.Preparing to unpack .../6-libapparmor1_3.0.8-3_amd64.deb ...Unpacking libapparmor1:amd64 (3.0.8-3) ...Preparing to unpack .../7-liblzma5_5.4.1-1+deb12u2_amd64.deb ...Unpacking liblzma5:amd64 (5.4.1-1+deb12u2) over (5.4.1-1+deb12u1) ...Setting up liblzma5:amd64 (5.4.1-1+deb12u2) ...Selecting previously unselected package libsystemd-shared:amd64.(Reading database ... (Reading database ... 5% (Reading database ... 10% (Reading database ... 15% (Reading database ... 20% (Reading database ... 25% (Reading database ... 30% (Reading database ... 35% (Reading database ... 40% (Reading database ... 45% (Reading database ... 50% (Reading database ... 55% (Reading database ... 60% (Reading database ... 65% (Reading database ... 70% (Reading database ... 75% (Reading database ... 80% (Reading database ... 85% (Reading database ... 90% (Reading database ... 95% (Reading database ... 100% (Reading database ... 17154 files and directories currently installed.)Preparing to unpack .../libsystemd-shared_252.39-1~deb12u2_amd64.deb ...Unpacking libsystemd-shared:amd64 (252.39-1~deb12u2) ...Selecting previously unselected package systemd.Preparing to unpack .../systemd_252.39-1~deb12u2_amd64.deb ...Unpacking systemd (252.39-1~deb12u2) ...Setting up libargon2-1:amd64 (0~20171227-0.3+deb12u1) ...Setting up libjson-c5:amd64 (0.16-2) ...Setting up libfdisk1:amd64 (2.38.1-5+deb12u3) ...Setting up libapparmor1:amd64 (3.0.8-3) ...Setting up libsystemd-shared:amd64 (252.39-1~deb12u2) ...Setting up libdevmapper1.02.1:amd64 (2:1.02.185-2) ...Setting up libcryptsetup12:amd64 (2:2.6.1-4~deb12u2) ...Setting up systemd (252.39-1~deb12u2) ...Created symlink /etc/systemd/system/getty.target.wants/getty@tty1.service → /lib/systemd/system/getty@.service. Created symlink /etc/systemd/system/multi-user.target.wants/remote-fs.target → /lib/systemd/system/remote-fs.target. Created symlink /etc/systemd/system/sysinit.target.wants/systemd-pstore.service → /lib/systemd/system/systemd-pstore.service. Initializing machine ID from random generator. Creating group 'systemd-journal' with GID 999. Creating group 'systemd-network' with GID 998. Creating user 'systemd-network' (systemd Network Management) with UID 998 and GID 998. Setting up dmsetup (2:1.02.185-2) ...Selecting previously unselected package systemd-sysv.(Reading database ... (Reading database ... 5% (Reading database ... 10% (Reading database ... 15% (Reading database ... 20% (Reading database ... 25% (Reading database ... 30% (Reading database ... 35% (Reading database ... 40% (Reading database ... 45% (Reading database ... 50% (Reading database ... 55% (Reading database ... 60% (Reading database ... 65% (Reading database ... 70% (Reading database ... 75% (Reading database ... 80% (Reading database ... 85% (Reading database ... 90% (Reading database ... 95% (Reading database ... 100% (Reading database ... 18003 files and directories currently installed.)Preparing to unpack .../00-systemd-sysv_252.39-1~deb12u2_amd64.deb ...Unpacking systemd-sysv (252.39-1~deb12u2) ...Selecting previously unselected package dbus-bin.Preparing to unpack .../01-dbus-bin_1.14.10-1~deb12u1_amd64.deb ...Unpacking dbus-bin (1.14.10-1~deb12u1) ...Selecting previously unselected package dbus-session-bus-common.Preparing to unpack .../02-dbus-session-bus-common_1.14.10-1~deb12u1_all.deb ...Unpacking dbus-session-bus-common (1.14.10-1~deb12u1) ...Preparing to unpack .../03-libexpat1_2.5.0-1+deb12u5_amd64.deb ...Unpacking libexpat1:amd64 (2.5.0-1+deb12u5) over (2.5.0-1+deb12u3) ...Selecting previously unselected package dbus-daemon.Preparing to unpack .../04-dbus-daemon_1.14.10-1~deb12u1_amd64.deb ...Unpacking dbus-daemon (1.14.10-1~deb12u1) ...Selecting previously unselected package dbus-system-bus-common.Preparing to unpack .../05-dbus-system-bus-common_1.14.10-1~deb12u1_all.deb ...Unpacking dbus-system-bus-common (1.14.10-1~deb12u1) ...Selecting previously unselected package dbus.Preparing to unpack .../06-dbus_1.14.10-1~deb12u1_amd64.deb ...Unpacking dbus (1.14.10-1~deb12u1) ...Selecting previously unselected package fonts-droid-fallback.Preparing to unpack .../07-fonts-droid-fallback_1%3a6.0.1r16-1.1_all.deb ...Unpacking fonts-droid-fallback (1:6.0.1r16-1.1) ...Selecting previously unselected package libfftw3-double3:amd64.Preparing to unpack .../08-libfftw3-double3_3.3.10-1_amd64.deb ...Unpacking libfftw3-double3:amd64 (3.3.10-1) ...Selecting previously unselected package libaom3:amd64.Preparing to unpack .../09-libaom3_3.6.0-1+deb12u3_amd64.deb ...Unpacking libaom3:amd64 (3.6.0-1+deb12u3) ...Selecting previously unselected package libdav1d6:amd64.Preparing to unpack .../10-libdav1d6_1.0.0-2+deb12u1_amd64.deb ...Unpacking libdav1d6:amd64 (1.0.0-2+deb12u1) ...Selecting previously unselected package libde265-0:amd64.Preparing to unpack .../11-libde265-0_1.0.11-1+deb12u3_amd64.deb ...Unpacking libde265-0:amd64 (1.0.11-1+deb12u3) ...Selecting previously unselected package libnuma1:amd64.Preparing to unpack .../12-libnuma1_2.0.16-1_amd64.deb ...Unpacking libnuma1:amd64 (2.0.16-1) ...Selecting previously unselected package libx265-199:amd64.Preparing to unpack .../13-libx265-199_3.5-2+b1_amd64.deb ...Unpacking libx265-199:amd64 (3.5-2+b1) ...Selecting previously unselected package libheif1:amd64.Preparing to unpack .../14-libheif1_1.15.1-1+deb12u1_amd64.deb ...Unpacking libheif1:amd64 (1.15.1-1+deb12u1) ...Selecting previously unselected package libjbig0:amd64.Preparing to unpack .../15-libjbig0_2.1-6.1_amd64.deb ...Unpacking libjbig0:amd64 (2.1-6.1) ...Selecting previously unselected package liblqr-1-0:amd64.Preparing to unpack .../16-liblqr-1-0_0.4.2-2.1_amd64.deb ...Unpacking liblqr-1-0:amd64 (0.4.2-2.1) ...Selecting previously unselected package libltdl7:amd64.Preparing to unpack .../17-libltdl7_2.4.7-7~deb12u1_amd64.deb ...Unpacking libltdl7:amd64 (2.4.7-7~deb12u1) ...Selecting previously unselected package libopenjp2-7:amd64.Preparing to unpack .../18-libopenjp2-7_2.5.0-2+deb12u3_amd64.deb ...Unpacking libopenjp2-7:amd64 (2.5.0-2+deb12u3) ...Preparing to unpack .../19-libpng16-16_1.6.39-2+deb12u6_amd64.deb ...Unpacking libpng16-16:amd64 (1.6.39-2+deb12u6) over (1.6.39-2+deb12u5) ...Selecting previously unselected package libdeflate0:amd64.Preparing to unpack .../20-libdeflate0_1.14-1_amd64.deb ...Unpacking libdeflate0:amd64 (1.14-1) ...Selecting previously unselected package liblerc4:amd64.Preparing to unpack .../21-liblerc4_4.0.0+ds-2_amd64.deb ...Unpacking liblerc4:amd64 (4.0.0+ds-2) ...Selecting previously unselected package libwebp7:amd64.Preparing to unpack .../22-libwebp7_1.2.4-0.2+deb12u1_amd64.deb ...Unpacking libwebp7:amd64 (1.2.4-0.2+deb12u1) ...Selecting previously unselected package libtiff6:amd64.Preparing to unpack .../23-libtiff6_4.5.0-6+deb12u4_amd64.deb ...Unpacking libtiff6:amd64 (4.5.0-6+deb12u4) ...Selecting previously unselected package libwebpdemux2:amd64.Preparing to unpack .../24-libwebpdemux2_1.2.4-0.2+deb12u1_amd64.deb ...Unpacking libwebpdemux2:amd64 (1.2.4-0.2+deb12u1) ...Selecting previously unselected package libwebpmux3:amd64.Preparing to unpack .../25-libwebpmux3_1.2.4-0.2+deb12u1_amd64.deb ...Unpacking libwebpmux3:amd64 (1.2.4-0.2+deb12u1) ...Selecting previously unselected package libxau6:amd64.Preparing to unpack .../26-libxau6_1%3a1.0.9-1_amd64.deb ...Unpacking libxau6:amd64 (1:1.0.9-1) ...Selecting previously unselected package libxdmcp6:amd64.Preparing to unpack .../27-libxdmcp6_1%3a1.1.2-3_amd64.deb ...Unpacking libxdmcp6:amd64 (1:1.1.2-3) ...Selecting previously unselected package libxcb1:amd64.Preparing to unpack .../28-libxcb1_1.15-1_amd64.deb ...Unpacking libxcb1:amd64 (1.15-1) ...Selecting previously unselected package libx11-data.Preparing to unpack .../29-libx11-data_2%3a1.8.4-2+deb12u2_all.deb ...Unpacking libx11-data (2:1.8.4-2+deb12u2) ...Selecting previously unselected package libx11-6:amd64.Preparing to unpack .../30-libx11-6_2%3a1.8.4-2+deb12u2_amd64.deb ...Unpacking libx11-6:amd64 (2:1.8.4-2+deb12u2) ...Selecting previously unselected package libxext6:amd64.Preparing to unpack .../31-libxext6_2%3a1.3.4-1+b1_amd64.deb ...Unpacking libxext6:amd64 (2:1.3.4-1+b1) ...Selecting previously unselected package libicu72:amd64.Preparing to unpack .../32-libicu72_72.1-3+deb12u1_amd64.deb ...Unpacking libicu72:amd64 (72.1-3+deb12u1) ...Selecting previously unselected package libxml2:amd64.Preparing to unpack .../33-libxml2_2.9.14+dfsg-1.3~deb12u6_amd64.deb ...Unpacking libxml2:amd64 (2.9.14+dfsg-1.3~deb12u6) ...Selecting previously unselected package imagemagick-6-common.Preparing to unpack .../34-imagemagick-6-common_8%3a6.9.11.60+dfsg-1.6+deb12u14_all.deb ...Unpacking imagemagick-6-common (8:6.9.11.60+dfsg-1.6+deb12u14) ...Selecting previously unselected package libmagickcore-6.q16-6:amd64.Preparing to unpack .../35-libmagickcore-6.q16-6_8%3a6.9.11.60+dfsg-1.6+deb12u14_amd64.deb ...Unpacking libmagickcore-6.q16-6:amd64 (8:6.9.11.60+dfsg-1.6+deb12u14) ...Selecting previously unselected package libmagickwand-6.q16-6:amd64.Preparing to unpack .../36-libmagickwand-6.q16-6_8%3a6.9.11.60+dfsg-1.6+deb12u14_amd64.deb ...Unpacking libmagickwand-6.q16-6:amd64 (8:6.9.11.60+dfsg-1.6+deb12u14) ...Selecting previously unselected package poppler-data.Preparing to unpack .../37-poppler-data_0.4.12-1_all.deb ...Unpacking poppler-data (0.4.12-1) ...Preparing to unpack .../38-libpcre2-8-0_10.42-1+deb12u2_amd64.deb ...Unpacking libpcre2-8-0:amd64 (10.42-1+deb12u2) over (10.42-1) ...Setting up libpcre2-8-0:amd64 (10.42-1+deb12u2) ...Selecting previously unselected package libnss-systemd:amd64.(Reading database ... (Reading database ... 5% (Reading database ... 10% (Reading database ... 15% (Reading database ... 20% (Reading database ... 25% (Reading database ... 30% (Reading database ... 35% (Reading database ... 40% (Reading database ... 45% (Reading database ... 50% (Reading database ... 55% (Reading database ... 60% (Reading database ... 65% (Reading database ... 70% (Reading database ... 75% (Reading database ... 80% (Reading database ... 85% (Reading database ... 90% (Reading database ... 95% (Reading database ... 100% (Reading database ... 19346 files and directories currently installed.)Preparing to unpack .../000-libnss-systemd_252.39-1~deb12u2_amd64.deb ...Unpacking libnss-systemd:amd64 (252.39-1~deb12u2) ...Selecting previously unselected package libpam-systemd:amd64.Preparing to unpack .../001-libpam-systemd_252.39-1~deb12u2_amd64.deb ...Unpacking libpam-systemd:amd64 (252.39-1~deb12u2) ...Selecting previously unselected package systemd-timesyncd.Preparing to unpack .../002-systemd-timesyncd_252.39-1~deb12u2_amd64.deb ...Unpacking systemd-timesyncd (252.39-1~deb12u2) ...Selecting previously unselected package ucf.Preparing to unpack .../003-ucf_3.0043+nmu1+deb12u1_all.deb ...Moving old data out of the wayUnpacking ucf (3.0043+nmu1+deb12u1) ...Preparing to unpack .../004-xz-utils_5.4.1-1+deb12u2_amd64.deb ...Unpacking xz-utils (5.4.1-1+deb12u2) over (5.4.1-1+deb12u1) ...Selecting previously unselected package hicolor-icon-theme.Preparing to unpack .../005-hicolor-icon-theme_0.17-2_all.deb ...Unpacking hicolor-icon-theme (0.17-2) ...Selecting previously unselected package libgdk-pixbuf2.0-common.Preparing to unpack .../006-libgdk-pixbuf2.0-common_2.42.10+dfsg-1+deb12u4_all.deb ...Unpacking libgdk-pixbuf2.0-common (2.42.10+dfsg-1+deb12u4) ...Selecting previously unselected package shared-mime-info.Preparing to unpack .../007-shared-mime-info_2.2-1_amd64.deb ...Unpacking shared-mime-info (2.2-1) ...Selecting previously unselected package libgdk-pixbuf-2.0-0:amd64.Preparing to unpack .../008-libgdk-pixbuf-2.0-0_2.42.10+dfsg-1+deb12u4_amd64.deb ...Unpacking libgdk-pixbuf-2.0-0:amd64 (2.42.10+dfsg-1+deb12u4) ...Selecting previously unselected package gtk-update-icon-cache.Preparing to unpack .../009-gtk-update-icon-cache_3.24.38-2~deb12u3_amd64.deb ...Unpacking gtk-update-icon-cache (3.24.38-2~deb12u3) ...Selecting previously unselected package adwaita-icon-theme.Preparing to unpack .../010-adwaita-icon-theme_43-1_all.deb ...Unpacking adwaita-icon-theme (43-1) ...Selecting previously unselected package libaspell15:amd64.Preparing to unpack .../011-libaspell15_0.60.8-4+b1_amd64.deb ...Unpacking libaspell15:amd64 (0.60.8-4+b1) ...Selecting previously unselected package libtext-iconv-perl:amd64.Preparing to unpack .../012-libtext-iconv-perl_1.7-8_amd64.deb ...Unpacking libtext-iconv-perl:amd64 (1.7-8) ...Selecting previously unselected package emacsen-common.Preparing to unpack .../013-emacsen-common_3.0.5_all.deb ...Unpacking emacsen-common (3.0.5) ...Selecting previously unselected package dictionaries-common.Preparing to unpack .../014-dictionaries-common_1.29.5_all.deb ...Adding 'diversion of /usr/share/dict/words to /usr/share/dict/words.pre-dictionaries-common by dictionaries-common'Unpacking dictionaries-common (1.29.5) ...Selecting previously unselected package aspell.Preparing to unpack .../015-aspell_0.60.8-4+b1_amd64.deb ...Unpacking aspell (0.60.8-4+b1) ...Selecting previously unselected package aspell-en.Preparing to unpack .../016-aspell-en_2020.12.07-0-1_all.deb ...Unpacking aspell-en (2020.12.07-0-1) ...Selecting previously unselected package at-spi2-common.Preparing to unpack .../017-at-spi2-common_2.46.0-5_all.deb ...Unpacking at-spi2-common (2.46.0-5) ...Selecting previously unselected package libxi6:amd64.Preparing to unpack .../018-libxi6_2%3a1.8-1+b1_amd64.deb ...Unpacking libxi6:amd64 (2:1.8-1+b1) ...Selecting previously unselected package libatspi2.0-0:amd64.Preparing to unpack .../019-libatspi2.0-0_2.46.0-5_amd64.deb ...Unpacking libatspi2.0-0:amd64 (2.46.0-5) ...Selecting previously unselected package x11-common.Preparing to unpack .../020-x11-common_1%3a7.7+23_all.deb ...Unpacking x11-common (1:7.7+23) ...Selecting previously unselected package libxtst6:amd64.Preparing to unpack .../021-libxtst6_2%3a1.2.3-1.1_amd64.deb ...Unpacking libxtst6:amd64 (2:1.2.3-1.1) ...Selecting previously unselected package dbus-user-session.Preparing to unpack .../022-dbus-user-session_1.14.10-1~deb12u1_amd64.deb ...Unpacking dbus-user-session (1.14.10-1~deb12u1) ...Selecting previously unselected package libdconf1:amd64.Preparing to unpack .../023-libdconf1_0.40.0-4_amd64.deb ...Unpacking libdconf1:amd64 (0.40.0-4) ...Selecting previously unselected package dconf-service.Preparing to unpack .../024-dconf-service_0.40.0-4_amd64.deb ...Unpacking dconf-service (0.40.0-4) ...Selecting previously unselected package dconf-gsettings-backend:amd64.Preparing to unpack .../025-dconf-gsettings-backend_0.40.0-4_amd64.deb ...Unpacking dconf-gsettings-backend:amd64 (0.40.0-4) ...Selecting previously unselected package gsettings-desktop-schemas.Preparing to unpack .../026-gsettings-desktop-schemas_43.0-1_all.deb ...Unpacking gsettings-desktop-schemas (43.0-1) ...Selecting previously unselected package at-spi2-core.Preparing to unpack .../027-at-spi2-core_2.46.0-5_amd64.deb ...Unpacking at-spi2-core (2.46.0-5) ...Selecting previously unselected package bubblewrap.Preparing to unpack .../028-bubblewrap_0.8.0-2+deb12u1_amd64.deb ...Unpacking bubblewrap (0.8.0-2+deb12u1) ...Selecting previously unselected package hunspell-en-us.Preparing to unpack .../029-hunspell-en-us_1%3a2020.12.07-2_all.deb ...Unpacking hunspell-en-us (1:2020.12.07-2) ...Selecting previously unselected package libhunspell-1.7-0:amd64.Preparing to unpack .../030-libhunspell-1.7-0_1.7.1-1_amd64.deb ...Unpacking libhunspell-1.7-0:amd64 (1.7.1-1) ...Selecting previously unselected package libenchant-2-2:amd64.Preparing to unpack .../031-libenchant-2-2_2.3.3-2_amd64.deb ...Unpacking libenchant-2-2:amd64 (2.3.3-2) ...Selecting previously unselected package enchant-2.Preparing to unpack .../032-enchant-2_2.3.3-2_amd64.deb ...Unpacking enchant-2 (2.3.3-2) ...Selecting previously unselected package fontconfig.Preparing to unpack .../033-fontconfig_2.14.1-4_amd64.deb ...Unpacking fontconfig (2.14.1-4) ...Selecting previously unselected package fonts-noto-mono.Preparing to unpack .../034-fonts-noto-mono_20201225-1_all.deb ...Unpacking fonts-noto-mono (20201225-1) ...Selecting previously unselected package libfontenc1:amd64.Preparing to unpack .../035-libfontenc1_1%3a1.1.4-1_amd64.deb ...Unpacking libfontenc1:amd64 (1:1.1.4-1) ...Selecting previously unselected package xfonts-encodings.Preparing to unpack .../036-xfonts-encodings_1%3a1.0.4-2.2_all.deb ...Unpacking xfonts-encodings (1:1.0.4-2.2) ...Selecting previously unselected package xfonts-utils.Preparing to unpack .../037-xfonts-utils_1%3a7.7+6_amd64.deb ...Unpacking xfonts-utils (1:7.7+6) ...Selecting previously unselected package fonts-urw-base35.Preparing to unpack .../038-fonts-urw-base35_20200910-7_all.deb ...Unpacking fonts-urw-base35 (20200910-7) ...Selecting previously unselected package libfuse3-3:amd64.Preparing to unpack .../039-libfuse3-3_3.14.0-4_amd64.deb ...Unpacking libfuse3-3:amd64 (3.14.0-4) ...Selecting previously unselected package fuse3.Preparing to unpack .../040-fuse3_3.14.0-4_amd64.deb ...Unpacking fuse3 (3.14.0-4) ...Selecting previously unselected package libgs-common.Preparing to unpack .../041-libgs-common_10.0.0~dfsg-11+deb12u8_all.deb ...Unpacking libgs-common (10.0.0~dfsg-11+deb12u8) ...Selecting previously unselected package libgs10-common.Preparing to unpack .../042-libgs10-common_10.0.0~dfsg-11+deb12u8_all.deb ...Unpacking libgs10-common (10.0.0~dfsg-11+deb12u8) ...Selecting previously unselected package libidn12:amd64.Preparing to unpack .../043-libidn12_1.41-1_amd64.deb ...Unpacking libidn12:amd64 (1.41-1) ...Selecting previously unselected package libijs-0.35:amd64.Preparing to unpack .../044-libijs-0.35_0.35-15_amd64.deb ...Unpacking libijs-0.35:amd64 (0.35-15) ...Selecting previously unselected package libjbig2dec0:amd64.Preparing to unpack .../045-libjbig2dec0_0.19-3+deb12u1_amd64.deb ...Unpacking libjbig2dec0:amd64 (0.19-3+deb12u1) ...Selecting previously unselected package libpaper1:amd64.Preparing to unpack .../046-libpaper1_1.1.29_amd64.deb ...Unpacking libpaper1:amd64 (1.1.29) ...Selecting previously unselected package libice6:amd64.Preparing to unpack .../047-libice6_2%3a1.0.10-1_amd64.deb ...Unpacking libice6:amd64 (2:1.0.10-1) ...Selecting previously unselected package libsm6:amd64.Preparing to unpack .../048-libsm6_2%3a1.2.3-1_amd64.deb ...Unpacking libsm6:amd64 (2:1.2.3-1) ...Selecting previously unselected package libxt6:amd64.Preparing to unpack .../049-libxt6_1%3a1.2.1-1.1_amd64.deb ...Unpacking libxt6:amd64 (1:1.2.1-1.1) ...Selecting previously unselected package libgs10:amd64.Preparing to unpack .../050-libgs10_10.0.0~dfsg-11+deb12u8_amd64.deb ...Unpacking libgs10:amd64 (10.0.0~dfsg-11+deb12u8) ...Selecting previously unselected package ghostscript.Preparing to unpack .../051-ghostscript_10.0.0~dfsg-11+deb12u8_amd64.deb ...Unpacking ghostscript (10.0.0~dfsg-11+deb12u8) ...Selecting previously unselected package libgirepository-1.0-1:amd64.Preparing to unpack .../052-libgirepository-1.0-1_1.74.0-3_amd64.deb ...Unpacking libgirepository-1.0-1:amd64 (1.74.0-3) ...Selecting previously unselected package gir1.2-glib-2.0:amd64.Preparing to unpack .../053-gir1.2-glib-2.0_1.74.0-3_amd64.deb ...Unpacking gir1.2-glib-2.0:amd64 (1.74.0-3) ...Selecting previously unselected package gir1.2-freedesktop:amd64.Preparing to unpack .../054-gir1.2-freedesktop_1.74.0-3_amd64.deb ...Unpacking gir1.2-freedesktop:amd64 (1.74.0-3) ...Selecting previously unselected package gir1.2-gdkpixbuf-2.0:amd64.Preparing to unpack .../055-gir1.2-gdkpixbuf-2.0_2.42.10+dfsg-1+deb12u4_amd64.deb ...Unpacking gir1.2-gdkpixbuf-2.0:amd64 (2.42.10+dfsg-1+deb12u4) ...Selecting previously unselected package libgraphene-1.0-0:amd64.Preparing to unpack .../056-libgraphene-1.0-0_1.10.8-1_amd64.deb ...Unpacking libgraphene-1.0-0:amd64 (1.10.8-1) ...Selecting previously unselected package gir1.2-graphene-1.0:amd64.Preparing to unpack .../057-gir1.2-graphene-1.0_1.10.8-1_amd64.deb ...Unpacking gir1.2-graphene-1.0:amd64 (1.10.8-1) ...Selecting previously unselected package gir1.2-harfbuzz-0.0:amd64.Preparing to unpack .../058-gir1.2-harfbuzz-0.0_6.0.0+dfsg-3_amd64.deb ...Unpacking gir1.2-harfbuzz-0.0:amd64 (6.0.0+dfsg-3) ...Selecting previously unselected package libfribidi0:amd64.Preparing to unpack .../059-libfribidi0_1.0.8-2.1_amd64.deb ...Unpacking libfribidi0:amd64 (1.0.8-2.1) ...Selecting previously unselected package libthai-data.Preparing to unpack .../060-libthai-data_0.1.29-1_all.deb ...Unpacking libthai-data (0.1.29-1) ...Selecting previously unselected package libdatrie1:amd64.Preparing to unpack .../061-libdatrie1_0.2.13-2+b1_amd64.deb ...Unpacking libdatrie1:amd64 (0.2.13-2+b1) ...Selecting previously unselected package libthai0:amd64.Preparing to unpack .../062-libthai0_0.1.29-1_amd64.deb ...Unpacking libthai0:amd64 (0.1.29-1) ...Selecting previously unselected package libpango-1.0-0:amd64.Preparing to unpack .../063-libpango-1.0-0_1.50.12+ds-1_amd64.deb ...Unpacking libpango-1.0-0:amd64 (1.50.12+ds-1) ...Selecting previously unselected package libpixman-1-0:amd64.Preparing to unpack .../064-libpixman-1-0_0.42.2-1_amd64.deb ...Unpacking libpixman-1-0:amd64 (0.42.2-1) ...Selecting previously unselected package libxcb-render0:amd64.Preparing to unpack .../065-libxcb-render0_1.15-1_amd64.deb ...Unpacking libxcb-render0:amd64 (1.15-1) ...Selecting previously unselected package libxcb-shm0:amd64.Preparing to unpack .../066-libxcb-shm0_1.15-1_amd64.deb ...Unpacking libxcb-shm0:amd64 (1.15-1) ...Selecting previously unselected package libxrender1:amd64.Preparing to unpack .../067-libxrender1_1%3a0.9.10-1.1_amd64.deb ...Unpacking libxrender1:amd64 (1:0.9.10-1.1) ...Selecting previously unselected package libcairo2:amd64.Preparing to unpack .../068-libcairo2_1.16.0-7_amd64.deb ...Unpacking libcairo2:amd64 (1.16.0-7) ...Selecting previously unselected package libpangoft2-1.0-0:amd64.Preparing to unpack .../069-libpangoft2-1.0-0_1.50.12+ds-1_amd64.deb ...Unpacking libpangoft2-1.0-0:amd64 (1.50.12+ds-1) ...Selecting previously unselected package libpangocairo-1.0-0:amd64.Preparing to unpack .../070-libpangocairo-1.0-0_1.50.12+ds-1_amd64.deb ...Unpacking libpangocairo-1.0-0:amd64 (1.50.12+ds-1) ...Selecting previously unselected package libxft2:amd64.Preparing to unpack .../071-libxft2_2.3.6-1_amd64.deb ...Unpacking libxft2:amd64 (2.3.6-1) ...Selecting previously unselected package libpangoxft-1.0-0:amd64.Preparing to unpack .../072-libpangoxft-1.0-0_1.50.12+ds-1_amd64.deb ...Unpacking libpangoxft-1.0-0:amd64 (1.50.12+ds-1) ...Selecting previously unselected package gir1.2-pango-1.0:amd64.Preparing to unpack .../073-gir1.2-pango-1.0_1.50.12+ds-1_amd64.deb ...Unpacking gir1.2-pango-1.0:amd64 (1.50.12+ds-1) ...Selecting previously unselected package libcairo-gobject2:amd64.Preparing to unpack .../074-libcairo-gobject2_1.16.0-7_amd64.deb ...Unpacking libcairo-gobject2:amd64 (1.16.0-7) ...Selecting previously unselected package liblzo2-2:amd64.Preparing to unpack .../075-liblzo2-2_2.10-2_amd64.deb ...Unpacking liblzo2-2:amd64 (2.10-2) ...Selecting previously unselected package libcairo-script-interpreter2:amd64.Preparing to unpack .../076-libcairo-script-interpreter2_1.16.0-7_amd64.deb ...Unpacking libcairo-script-interpreter2:amd64 (1.16.0-7) ...Selecting previously unselected package libcloudproviders0:amd64.Preparing to unpack .../077-libcloudproviders0_0.3.1-2_amd64.deb ...Unpacking libcloudproviders0:amd64 (0.3.1-2) ...Selecting previously unselected package libcolord2:amd64.Preparing to unpack .../078-libcolord2_1.4.6-2.2_amd64.deb ...Unpacking libcolord2:amd64 (1.4.6-2.2) ...Selecting previously unselected package libepoxy0:amd64.Preparing to unpack .../079-libepoxy0_1.5.10-1_amd64.deb ...Unpacking libepoxy0:amd64 (1.5.10-1) ...Selecting previously unselected package libwayland-client0:amd64.Preparing to unpack .../080-libwayland-client0_1.21.0-1_amd64.deb ...Unpacking libwayland-client0:amd64 (1.21.0-1) ...Selecting previously unselected package libwayland-egl1:amd64.Preparing to unpack .../081-libwayland-egl1_1.21.0-1_amd64.deb ...Unpacking libwayland-egl1:amd64 (1.21.0-1) ...Selecting previously unselected package libxfixes3:amd64.Preparing to unpack .../082-libxfixes3_1%3a6.0.0-2_amd64.deb ...Unpacking libxfixes3:amd64 (1:6.0.0-2) ...Selecting previously unselected package libxcursor1:amd64.Preparing to unpack .../083-libxcursor1_1%3a1.2.1-1_amd64.deb ...Unpacking libxcursor1:amd64 (1:1.2.1-1) ...Selecting previously unselected package libxdamage1:amd64.Preparing to unpack .../084-libxdamage1_1%3a1.1.6-1_amd64.deb ...Unpacking libxdamage1:amd64 (1:1.1.6-1) ...Selecting previously unselected package libxinerama1:amd64.Preparing to unpack .../085-libxinerama1_2%3a1.1.4-3_amd64.deb ...Unpacking libxinerama1:amd64 (2:1.1.4-3) ...Selecting previously unselected package xkb-data.Preparing to unpack .../086-xkb-data_2.35.1-1_all.deb ...Unpacking xkb-data (2.35.1-1) ...Selecting previously unselected package libxkbcommon0:amd64.Preparing to unpack .../087-libxkbcommon0_1.5.0-1_amd64.deb ...Unpacking libxkbcommon0:amd64 (1.5.0-1) ...Selecting previously unselected package libxrandr2:amd64.Preparing to unpack .../088-libxrandr2_2%3a1.5.2-2+b1_amd64.deb ...Unpacking libxrandr2:amd64 (2:1.5.2-2+b1) ...Selecting previously unselected package libgtk-4-common.Preparing to unpack .../089-libgtk-4-common_4.8.3+ds-2+deb12u1_all.deb ...Unpacking libgtk-4-common (4.8.3+ds-2+deb12u1) ...Selecting previously unselected package libgtk-4-1:amd64.Preparing to unpack .../090-libgtk-4-1_4.8.3+ds-2+deb12u1_amd64.deb ...Unpacking libgtk-4-1:amd64 (4.8.3+ds-2+deb12u1) ...Selecting previously unselected package gir1.2-gtk-4.0:amd64.Preparing to unpack .../091-gir1.2-gtk-4.0_4.8.3+ds-2+deb12u1_amd64.deb ...Unpacking gir1.2-gtk-4.0:amd64 (4.8.3+ds-2+deb12u1) ...Selecting previously unselected package libadwaita-1-0:amd64.Preparing to unpack .../092-libadwaita-1-0_1.2.2-1_amd64.deb ...Unpacking libadwaita-1-0:amd64 (1.2.2-1) ...Selecting previously unselected package gir1.2-adw-1:amd64.Preparing to unpack .../093-gir1.2-adw-1_1.2.2-1_amd64.deb ...Unpacking gir1.2-adw-1:amd64 (1.2.2-1) ...Selecting previously unselected package libjavascriptcoregtk-6.0-1:amd64.Preparing to unpack .../094-libjavascriptcoregtk-6.0-1_2.50.6-1~deb12u2_amd64.deb ...Unpacking libjavascriptcoregtk-6.0-1:amd64 (2.50.6-1~deb12u2) ...Selecting previously unselected package gir1.2-javascriptcoregtk-6.0:amd64.Preparing to unpack .../095-gir1.2-javascriptcoregtk-6.0_2.50.6-1~deb12u2_amd64.deb ...Unpacking gir1.2-javascriptcoregtk-6.0:amd64 (2.50.6-1~deb12u2) ...Selecting previously unselected package libjson-glib-1.0-common.Preparing to unpack .../096-libjson-glib-1.0-common_1.6.6-1_all.deb ...Unpacking libjson-glib-1.0-common (1.6.6-1) ...Selecting previously unselected package libjson-glib-1.0-0:amd64.Preparing to unpack .../097-libjson-glib-1.0-0_1.6.6-1_amd64.deb ...Unpacking libjson-glib-1.0-0:amd64 (1.6.6-1) ...Selecting previously unselected package gir1.2-json-1.0:amd64.Preparing to unpack .../098-gir1.2-json-1.0_1.6.6-1_amd64.deb ...Unpacking gir1.2-json-1.0:amd64 (1.6.6-1) ...Selecting previously unselected package libpolkit-gobject-1-0:amd64.Preparing to unpack .../099-libpolkit-gobject-1-0_122-3_amd64.deb ...Unpacking libpolkit-gobject-1-0:amd64 (122-3) ...Selecting previously unselected package libpolkit-agent-1-0:amd64.Preparing to unpack .../100-libpolkit-agent-1-0_122-3_amd64.deb ...Unpacking libpolkit-agent-1-0:amd64 (122-3) ...Selecting previously unselected package gir1.2-polkit-1.0.Preparing to unpack .../101-gir1.2-polkit-1.0_122-3_amd64.deb ...Unpacking gir1.2-polkit-1.0 (122-3) ...Selecting previously unselected package libproxy1v5:amd64.Preparing to unpack .../102-libproxy1v5_0.4.18-1.2_amd64.deb ...Unpacking libproxy1v5:amd64 (0.4.18-1.2) ...Selecting previously unselected package glib-networking-common.Preparing to unpack .../103-glib-networking-common_2.74.0-4_all.deb ...Unpacking glib-networking-common (2.74.0-4) ...Selecting previously unselected package glib-networking-services.Preparing to unpack .../104-glib-networking-services_2.74.0-4_amd64.deb ...Unpacking glib-networking-services (2.74.0-4) ...Selecting previously unselected package glib-networking:amd64.Preparing to unpack .../105-glib-networking_2.74.0-4_amd64.deb ...Unpacking glib-networking:amd64 (2.74.0-4) ...Selecting previously unselected package libsoup-3.0-common.Preparing to unpack .../106-libsoup-3.0-common_3.2.3-0+deb12u2_all.deb ...Unpacking libsoup-3.0-common (3.2.3-0+deb12u2) ...Preparing to unpack .../107-libbrotli1_1.0.9-2+deb12u1_amd64.deb ...Unpacking libbrotli1:amd64 (1.0.9-2+deb12u1) over (1.0.9-2+b6) ...Selecting previously unselected package libsoup-3.0-0:amd64.Preparing to unpack .../108-libsoup-3.0-0_3.2.3-0+deb12u2_amd64.deb ...Unpacking libsoup-3.0-0:amd64 (3.2.3-0+deb12u2) ...Selecting previously unselected package gir1.2-soup-3.0:amd64.Preparing to unpack .../109-gir1.2-soup-3.0_3.2.3-0+deb12u2_amd64.deb ...Unpacking gir1.2-soup-3.0:amd64 (3.2.3-0+deb12u2) ...Selecting previously unselected package libcdparanoia0:amd64.Preparing to unpack .../110-libcdparanoia0_3.10.2+debian-14_amd64.deb ...Unpacking libcdparanoia0:amd64 (3.10.2+debian-14) ...Selecting previously unselected package libdw1:amd64.Preparing to unpack .../111-libdw1_0.188-2.1_amd64.deb ...Unpacking libdw1:amd64 (0.188-2.1) ...Selecting previously unselected package libunwind8:amd64.Preparing to unpack .../112-libunwind8_1.6.2-3_amd64.deb ...Unpacking libunwind8:amd64 (1.6.2-3) ...Selecting previously unselected package libgstreamer1.0-0:amd64.Preparing to unpack .../113-libgstreamer1.0-0_1.22.0-2+deb12u1_amd64.deb ...Unpacking libgstreamer1.0-0:amd64 (1.22.0-2+deb12u1) ...Selecting previously unselected package liborc-0.4-0:amd64.Preparing to unpack .../114-liborc-0.4-0_1%3a0.4.33-2_amd64.deb ...Unpacking liborc-0.4-0:amd64 (1:0.4.33-2) ...Selecting previously unselected package iso-codes.Preparing to unpack .../115-iso-codes_4.15.0-1_all.deb ...Unpacking iso-codes (4.15.0-1) ...Selecting previously unselected package libgstreamer-plugins-base1.0-0:amd64.Preparing to unpack .../116-libgstreamer-plugins-base1.0-0_1.22.0-3+deb12u7_amd64.deb ...Unpacking libgstreamer-plugins-base1.0-0:amd64 (1.22.0-3+deb12u7) ...Selecting previously unselected package libogg0:amd64.Preparing to unpack .../117-libogg0_1.3.5-3_amd64.deb ...Unpacking libogg0:amd64 (1.3.5-3) ...Selecting previously unselected package libopus0:amd64.Preparing to unpack .../118-libopus0_1.3.1-3_amd64.deb ...Unpacking libopus0:amd64 (1.3.1-3) ...Selecting previously unselected package libtheora0:amd64.Preparing to unpack .../119-libtheora0_1.1.1+dfsg.1-16.1+deb12u1_amd64.deb ...Unpacking libtheora0:amd64 (1.1.1+dfsg.1-16.1+deb12u1) ...Selecting previously unselected package libvisual-0.4-0:amd64.Preparing to unpack .../120-libvisual-0.4-0_0.4.0-19_amd64.deb ...Unpacking libvisual-0.4-0:amd64 (0.4.0-19) ...Selecting previously unselected package libvorbis0a:amd64.Preparing to unpack .../121-libvorbis0a_1.3.7-1_amd64.deb ...Unpacking libvorbis0a:amd64 (1.3.7-1) ...Selecting previously unselected package libvorbisenc2:amd64.Preparing to unpack .../122-libvorbisenc2_1.3.7-1_amd64.deb ...Unpacking libvorbisenc2:amd64 (1.3.7-1) ...Selecting previously unselected package gstreamer1.0-plugins-base:amd64.Preparing to unpack .../123-gstreamer1.0-plugins-base_1.22.0-3+deb12u7_amd64.deb ...Unpacking gstreamer1.0-plugins-base:amd64 (1.22.0-3+deb12u7) ...Selecting previously unselected package libgpm2:amd64.Preparing to unpack .../124-libgpm2_1.20.7-10+b1_amd64.deb ...Unpacking libgpm2:amd64 (1.20.7-10+b1) ...Selecting previously unselected package libncurses6:amd64.Preparing to unpack .../125-libncurses6_6.4-4_amd64.deb ...Unpacking libncurses6:amd64 (6.4-4) ...Selecting previously unselected package libslang2:amd64.Preparing to unpack .../126-libslang2_2.3.3-3_amd64.deb ...Unpacking libslang2:amd64 (2.3.3-3) ...Selecting previously unselected package libaa1:amd64.Preparing to unpack .../127-libaa1_1.4p5-50_amd64.deb ...Unpacking libaa1:amd64 (1.4p5-50) ...Selecting previously unselected package libraw1394-11:amd64.Preparing to unpack .../128-libraw1394-11_2.1.2-2_amd64.deb ...Unpacking libraw1394-11:amd64 (2.1.2-2) ...Selecting previously unselected package libavc1394-0:amd64.Preparing to unpack .../129-libavc1394-0_0.5.4-5_amd64.deb ...Unpacking libavc1394-0:amd64 (0.5.4-5) ...Selecting previously unselected package libcaca0:amd64.Preparing to unpack .../130-libcaca0_0.99.beta20-3+deb12u1_amd64.deb ...Unpacking libcaca0:amd64 (0.99.beta20-3+deb12u1) ...Selecting previously unselected package libdv4:amd64.Preparing to unpack .../131-libdv4_1.0.0-15_amd64.deb ...Unpacking libdv4:amd64 (1.0.0-15) ...Selecting previously unselected package libflac12:amd64.Preparing to unpack .../132-libflac12_1.4.2+ds-2_amd64.deb ...Unpacking libflac12:amd64 (1.4.2+ds-2) ...Selecting previously unselected package libgudev-1.0-0:amd64.Preparing to unpack .../133-libgudev-1.0-0_237-2_amd64.deb ...Unpacking libgudev-1.0-0:amd64 (237-2) ...Selecting previously unselected package libiec61883-0:amd64.Preparing to unpack .../134-libiec61883-0_1.2.0-6+b1_amd64.deb ...Unpacking libiec61883-0:amd64 (1.2.0-6+b1) ...Selecting previously unselected package libsamplerate0:amd64.Preparing to unpack .../135-libsamplerate0_0.2.2-3_amd64.deb ...Unpacking libsamplerate0:amd64 (0.2.2-3) ...Selecting previously unselected package libjack-jackd2-0:amd64.Preparing to unpack .../136-libjack-jackd2-0_1.9.21~dfsg-3_amd64.deb ...Unpacking libjack-jackd2-0:amd64 (1.9.21~dfsg-3) ...Selecting previously unselected package libmp3lame0:amd64.Preparing to unpack .../137-libmp3lame0_3.100-6_amd64.deb ...Unpacking libmp3lame0:amd64 (3.100-6) ...Selecting previously unselected package libmpg123-0:amd64.Preparing to unpack .../138-libmpg123-0_1.31.2-1+deb12u1_amd64.deb ...Unpacking libmpg123-0:amd64 (1.31.2-1+deb12u1) ...Selecting previously unselected package libasyncns0:amd64.Preparing to unpack .../139-libasyncns0_0.8-6+b3_amd64.deb ...Unpacking libasyncns0:amd64 (0.8-6+b3) ...Selecting previously unselected package libsndfile1:amd64.Preparing to unpack .../140-libsndfile1_1.2.0-1+deb12u1_amd64.deb ...Unpacking libsndfile1:amd64 (1.2.0-1+deb12u1) ...Selecting previously unselected package libx11-xcb1:amd64.Preparing to unpack .../141-libx11-xcb1_2%3a1.8.4-2+deb12u2_amd64.deb ...Unpacking libx11-xcb1:amd64 (2:1.8.4-2+deb12u2) ...Selecting previously unselected package libpulse0:amd64.Preparing to unpack .../142-libpulse0_16.1+dfsg1-2+b1_amd64.deb ...Unpacking libpulse0:amd64 (16.1+dfsg1-2+b1) ...Selecting previously unselected package libspeex1:amd64.Preparing to unpack .../143-libspeex1_1.2.1-2_amd64.deb ...Unpacking libspeex1:amd64 (1.2.1-2) ...Selecting previously unselected package libshout3:amd64.Preparing to unpack .../144-libshout3_2.4.6-1+b1_amd64.deb ...Unpacking libshout3:amd64 (2.4.6-1+b1) ...Selecting previously unselected package libtag1v5-vanilla:amd64.Preparing to unpack .../145-libtag1v5-vanilla_1.13-2+deb12u1_amd64.deb ...Unpacking libtag1v5-vanilla:amd64 (1.13-2+deb12u1) ...Selecting previously unselected package libtag1v5:amd64.Preparing to unpack .../146-libtag1v5_1.13-2+deb12u1_amd64.deb ...Unpacking libtag1v5:amd64 (1.13-2+deb12u1) ...Selecting previously unselected package libtwolame0:amd64.Preparing to unpack .../147-libtwolame0_0.4.0-2_amd64.deb ...Unpacking libtwolame0:amd64 (0.4.0-2) ...Selecting previously unselected package libv4lconvert0:amd64.Preparing to unpack .../148-libv4lconvert0_1.22.1-5+b2_amd64.deb ...Unpacking libv4lconvert0:amd64 (1.22.1-5+b2) ...Selecting previously unselected package libv4l-0:amd64.Preparing to unpack .../149-libv4l-0_1.22.1-5+b2_amd64.deb ...Unpacking libv4l-0:amd64 (1.22.1-5+b2) ...Selecting previously unselected package libvpx7:amd64.Preparing to unpack .../150-libvpx7_1.12.0-1+deb12u5_amd64.deb ...Unpacking libvpx7:amd64 (1.12.0-1+deb12u5) ...Selecting previously unselected package libwavpack1:amd64.Preparing to unpack .../151-libwavpack1_5.6.0-1_amd64.deb ...Unpacking libwavpack1:amd64 (5.6.0-1) ...Selecting previously unselected package libsoup2.4-common.Preparing to unpack .../152-libsoup2.4-common_2.74.3-1+deb12u1_all.deb ...Unpacking libsoup2.4-common (2.74.3-1+deb12u1) ...Selecting previously unselected package libsoup2.4-1:amd64.Preparing to unpack .../153-libsoup2.4-1_2.74.3-1+deb12u1_amd64.deb ...Unpacking libsoup2.4-1:amd64 (2.74.3-1+deb12u1) ...Selecting previously unselected package gstreamer1.0-plugins-good:amd64.Preparing to unpack .../154-gstreamer1.0-plugins-good_1.22.0-5+deb12u4_amd64.deb ...Unpacking gstreamer1.0-plugins-good:amd64 (1.22.0-5+deb12u4) ...Selecting previously unselected package libglvnd0:amd64.Preparing to unpack .../155-libglvnd0_1.6.0-1_amd64.deb ...Unpacking libglvnd0:amd64 (1.6.0-1) ...Selecting previously unselected package libgles2:amd64.Preparing to unpack .../156-libgles2_1.6.0-1_amd64.deb ...Unpacking libgles2:amd64 (1.6.0-1) ...Selecting previously unselected package xdg-dbus-proxy.Preparing to unpack .../157-xdg-dbus-proxy_0.1.4-3+deb12u2_amd64.deb ...Unpacking xdg-dbus-proxy (0.1.4-3+deb12u2) ...Selecting previously unselected package libabsl20220623:amd64.Preparing to unpack .../158-libabsl20220623_20220623.1-1+deb12u2_amd64.deb ...Unpacking libabsl20220623:amd64 (20220623.1-1+deb12u2) ...Selecting previously unselected package libgav1-1:amd64.Preparing to unpack .../159-libgav1-1_0.18.0-1+b1_amd64.deb ...Unpacking libgav1-1:amd64 (0.18.0-1+b1) ...Selecting previously unselected package librav1e0:amd64.Preparing to unpack .../160-librav1e0_0.5.1-6_amd64.deb ...Unpacking librav1e0:amd64 (0.5.1-6) ...Selecting previously unselected package libsvtav1enc1:amd64.Preparing to unpack .../161-libsvtav1enc1_1.4.1+dfsg-1_amd64.deb ...Unpacking libsvtav1enc1:amd64 (1.4.1+dfsg-1) ...Selecting previously unselected package libyuv0:amd64.Preparing to unpack .../162-libyuv0_0.0~git20230123.b2528b0-1_amd64.deb ...Unpacking libyuv0:amd64 (0.0~git20230123.b2528b0-1) ...Selecting previously unselected package libavif15:amd64.Preparing to unpack .../163-libavif15_0.11.1-1+deb12u1_amd64.deb ...Unpacking libavif15:amd64 (0.11.1-1+deb12u1) ...Selecting previously unselected package libdrm-common.Preparing to unpack .../164-libdrm-common_2.4.114-1_all.deb ...Unpacking libdrm-common (2.4.114-1) ...Selecting previously unselected package libdrm2:amd64.Preparing to unpack .../165-libdrm2_2.4.114-1+b1_amd64.deb ...Unpacking libdrm2:amd64 (2.4.114-1+b1) ...Selecting previously unselected package libflite1:amd64.Preparing to unpack .../166-libflite1_2.2-5_amd64.deb ...Unpacking libflite1:amd64 (2.2-5) ...Selecting previously unselected package libwayland-server0:amd64.Preparing to unpack .../167-libwayland-server0_1.21.0-1_amd64.deb ...Unpacking libwayland-server0:amd64 (1.21.0-1) ...Selecting previously unselected package libgbm1:amd64.Preparing to unpack .../168-libgbm1_22.3.6-1+deb12u2_amd64.deb ...Unpacking libgbm1:amd64 (22.3.6-1+deb12u2) ...Selecting previously unselected package libglapi-mesa:amd64.Preparing to unpack .../169-libglapi-mesa_22.3.6-1+deb12u2_amd64.deb ...Unpacking libglapi-mesa:amd64 (22.3.6-1+deb12u2) ...Selecting previously unselected package libxcb-dri2-0:amd64.Preparing to unpack .../170-libxcb-dri2-0_1.15-1_amd64.deb ...Unpacking libxcb-dri2-0:amd64 (1.15-1) ...Selecting previously unselected package libxcb-dri3-0:amd64.Preparing to unpack .../171-libxcb-dri3-0_1.15-1_amd64.deb ...Unpacking libxcb-dri3-0:amd64 (1.15-1) ...Selecting previously unselected package libxcb-present0:amd64.Preparing to unpack .../172-libxcb-present0_1.15-1_amd64.deb ...Unpacking libxcb-present0:amd64 (1.15-1) ...Selecting previously unselected package libxcb-randr0:amd64.Preparing to unpack .../173-libxcb-randr0_1.15-1_amd64.deb ...Unpacking libxcb-randr0:amd64 (1.15-1) ...Selecting previously unselected package libxcb-sync1:amd64.Preparing to unpack .../174-libxcb-sync1_1.15-1_amd64.deb ...Unpacking libxcb-sync1:amd64 (1.15-1) ...Selecting previously unselected package libxcb-xfixes0:amd64.Preparing to unpack .../175-libxcb-xfixes0_1.15-1_amd64.deb ...Unpacking libxcb-xfixes0:amd64 (1.15-1) ...Selecting previously unselected package libxshmfence1:amd64.Preparing to unpack .../176-libxshmfence1_1.3-1_amd64.deb ...Unpacking libxshmfence1:amd64 (1.3-1) ...Selecting previously unselected package libegl-mesa0:amd64.Preparing to unpack .../177-libegl-mesa0_22.3.6-1+deb12u2_amd64.deb ...Unpacking libegl-mesa0:amd64 (22.3.6-1+deb12u2) ...Selecting previously unselected package libegl1:amd64.Preparing to unpack .../178-libegl1_1.6.0-1_amd64.deb ...Unpacking libegl1:amd64 (1.6.0-1) ...Selecting previously unselected package libxcb-glx0:amd64.Preparing to unpack .../179-libxcb-glx0_1.15-1_amd64.deb ...Unpacking libxcb-glx0:amd64 (1.15-1) ...Selecting previously unselected package libxxf86vm1:amd64.Preparing to unpack .../180-libxxf86vm1_1%3a1.1.4-1+b2_amd64.deb ...Unpacking libxxf86vm1:amd64 (1:1.1.4-1+b2) ...Selecting previously unselected package libdrm-amdgpu1:amd64.Preparing to unpack .../181-libdrm-amdgpu1_2.4.114-1+b1_amd64.deb ...Unpacking libdrm-amdgpu1:amd64 (2.4.114-1+b1) ...Selecting previously unselected package libpciaccess0:amd64.Preparing to unpack .../182-libpciaccess0_0.17-2_amd64.deb ...Unpacking libpciaccess0:amd64 (0.17-2) ...Selecting previously unselected package libdrm-intel1:amd64.Preparing to unpack .../183-libdrm-intel1_2.4.114-1+b1_amd64.deb ...Unpacking libdrm-intel1:amd64 (2.4.114-1+b1) ...Selecting previously unselected package libdrm-nouveau2:amd64.Preparing to unpack .../184-libdrm-nouveau2_2.4.114-1+b1_amd64.deb ...Unpacking libdrm-nouveau2:amd64 (2.4.114-1+b1) ...Selecting previously unselected package libdrm-radeon1:amd64.Preparing to unpack .../185-libdrm-radeon1_2.4.114-1+b1_amd64.deb ...Unpacking libdrm-radeon1:amd64 (2.4.114-1+b1) ...Selecting previously unselected package libz3-4:amd64.Preparing to unpack .../186-libz3-4_4.8.12-3.1_amd64.deb ...Unpacking libz3-4:amd64 (4.8.12-3.1) ...Selecting previously unselected package libllvm15:amd64.Preparing to unpack .../187-libllvm15_1%3a15.0.6-4+b1_amd64.deb ...Unpacking libllvm15:amd64 (1:15.0.6-4+b1) ...Selecting previously unselected package libsensors-config.Preparing to unpack .../188-libsensors-config_1%3a3.6.0-7.1_all.deb ...Unpacking libsensors-config (1:3.6.0-7.1) ...Selecting previously unselected package libsensors5:amd64.Preparing to unpack .../189-libsensors5_1%3a3.6.0-7.1_amd64.deb ...Unpacking libsensors5:amd64 (1:3.6.0-7.1) ...Selecting previously unselected package libgl1-mesa-dri:amd64.Preparing to unpack .../190-libgl1-mesa-dri_22.3.6-1+deb12u2_amd64.deb ...Unpacking libgl1-mesa-dri:amd64 (22.3.6-1+deb12u2) ...Selecting previously unselected package libglx-mesa0:amd64.Preparing to unpack .../191-libglx-mesa0_22.3.6-1+deb12u2_amd64.deb ...Unpacking libglx-mesa0:amd64 (22.3.6-1+deb12u2) ...Selecting previously unselected package libglx0:amd64.Preparing to unpack .../192-libglx0_1.6.0-1_amd64.deb ...Unpacking libglx0:amd64 (1.6.0-1) ...Selecting previously unselected package libgl1:amd64.Preparing to unpack .../193-libgl1_1.6.0-1_amd64.deb ...Unpacking libgl1:amd64 (1.6.0-1) ...Selecting previously unselected package libwayland-cursor0:amd64.Preparing to unpack .../194-libwayland-cursor0_1.21.0-1_amd64.deb ...Unpacking libwayland-cursor0:amd64 (1.21.0-1) ...Selecting previously unselected package libgstreamer-gl1.0-0:amd64.Preparing to unpack .../195-libgstreamer-gl1.0-0_1.22.0-3+deb12u7_amd64.deb ...Unpacking libgstreamer-gl1.0-0:amd64 (1.22.0-3+deb12u7) ...Selecting previously unselected package libharfbuzz-icu0:amd64.Preparing to unpack .../196-libharfbuzz-icu0_6.0.0+dfsg-3_amd64.deb ...Unpacking libharfbuzz-icu0:amd64 (6.0.0+dfsg-3) ...Selecting previously unselected package libhyphen0:amd64.Preparing to unpack .../197-libhyphen0_2.8.8-7_amd64.deb ...Unpacking libhyphen0:amd64 (2.8.8-7) ...Selecting previously unselected package libevdev2:amd64.Preparing to unpack .../198-libevdev2_1.13.0+dfsg-1_amd64.deb ...Unpacking libevdev2:amd64 (1.13.0+dfsg-1) ...Selecting previously unselected package libmanette-0.2-0:amd64.Preparing to unpack .../199-libmanette-0.2-0_0.2.6-3+b1_amd64.deb ...Unpacking libmanette-0.2-0:amd64 (0.2.6-3+b1) ...Selecting previously unselected package libsecret-common.Preparing to unpack .../200-libsecret-common_0.20.5-3_all.deb ...Unpacking libsecret-common (0.20.5-3) ...Selecting previously unselected package libsecret-1-0:amd64.Preparing to unpack .../201-libsecret-1-0_0.20.5-3_amd64.deb ...Unpacking libsecret-1-0:amd64 (0.20.5-3) ...Selecting previously unselected package libwoff1:amd64.Preparing to unpack .../202-libwoff1_1.0.2-2_amd64.deb ...Unpacking libwoff1:amd64 (1.0.2-2) ...Selecting previously unselected package libxslt1.1:amd64.Preparing to unpack .../203-libxslt1.1_1.1.35-1+deb12u4_amd64.deb ...Unpacking libxslt1.1:amd64 (1.1.35-1+deb12u4) ...Selecting previously unselected package libwebkitgtk-6.0-4:amd64.Preparing to unpack .../204-libwebkitgtk-6.0-4_2.50.6-1~deb12u2_amd64.deb ...Unpacking libwebkitgtk-6.0-4:amd64 (2.50.6-1~deb12u2) ...Selecting previously unselected package gir1.2-webkit-6.0:amd64.Preparing to unpack .../205-gir1.2-webkit-6.0_2.50.6-1~deb12u2_amd64.deb ...Unpacking gir1.2-webkit-6.0:amd64 (2.50.6-1~deb12u2) ...Selecting previously unselected package python3-lib2to3.Preparing to unpack .../206-python3-lib2to3_3.11.2-3_all.deb ...Unpacking python3-lib2to3 (3.11.2-3) ...Selecting previously unselected package python3-distutils.Preparing to unpack .../207-python3-distutils_3.11.2-3_all.deb ...Unpacking python3-distutils (3.11.2-3) ...Selecting previously unselected package python3-pkg-resources.Preparing to unpack .../208-python3-pkg-resources_66.1.1-1+deb12u2_all.deb ...Unpacking python3-pkg-resources (66.1.1-1+deb12u2) ...Selecting previously unselected package python3-markupsafe.Preparing to unpack .../209-python3-markupsafe_2.1.2-1+b1_amd64.deb ...Unpacking python3-markupsafe (2.1.2-1+b1) ...Selecting previously unselected package python3-mako.Preparing to unpack .../210-python3-mako_1.2.4+ds-1_all.deb ...Unpacking python3-mako (1.2.4+ds-1) ...Selecting previously unselected package python3-markdown.Preparing to unpack .../211-python3-markdown_3.4.1-2+deb12u1_all.deb ...Unpacking python3-markdown (3.4.1-2+deb12u1) ...Selecting previously unselected package gobject-introspection.Preparing to unpack .../212-gobject-introspection_1.74.0-3_amd64.deb ...Unpacking gobject-introspection (1.74.0-3) ...Selecting previously unselected package gsfonts.Preparing to unpack .../213-gsfonts_2%3a20200910-7_all.deb ...Unpacking gsfonts (2:20200910-7) ...Selecting previously unselected package gstreamer1.0-gl:amd64.Preparing to unpack .../214-gstreamer1.0-gl_1.22.0-3+deb12u7_amd64.deb ...Unpacking gstreamer1.0-gl:amd64 (1.22.0-3+deb12u7) ...Selecting previously unselected package libva2:amd64.Preparing to unpack .../215-libva2_2.17.0-1_amd64.deb ...Unpacking libva2:amd64 (2.17.0-1) ...Selecting previously unselected package libmfx1:amd64.Preparing to unpack .../216-libmfx1_22.5.4-1_amd64.deb ...Unpacking libmfx1:amd64 (22.5.4-1) ...Selecting previously unselected package libva-drm2:amd64.Preparing to unpack .../217-libva-drm2_2.17.0-1_amd64.deb ...Unpacking libva-drm2:amd64 (2.17.0-1) ...Selecting previously unselected package libva-x11-2:amd64.Preparing to unpack .../218-libva-x11-2_2.17.0-1_amd64.deb ...Unpacking libva-x11-2:amd64 (2.17.0-1) ...Selecting previously unselected package libvdpau1:amd64.Preparing to unpack .../219-libvdpau1_1.5-2_amd64.deb ...Unpacking libvdpau1:amd64 (1.5-2) ...Selecting previously unselected package ocl-icd-libopencl1:amd64.Preparing to unpack .../220-ocl-icd-libopencl1_2.3.1-1_amd64.deb ...Unpacking ocl-icd-libopencl1:amd64 (2.3.1-1) ...Selecting previously unselected package libavutil57:amd64.Preparing to unpack .../221-libavutil57_7%3a5.1.9-0+deb12u1_amd64.deb ...Unpacking libavutil57:amd64 (7:5.1.9-0+deb12u1) ...Selecting previously unselected package libcodec2-1.0:amd64.Preparing to unpack .../222-libcodec2-1.0_1.0.5-1_amd64.deb ...Unpacking libcodec2-1.0:amd64 (1.0.5-1) ...Selecting previously unselected package libgsm1:amd64.Preparing to unpack .../223-libgsm1_1.0.22-1_amd64.deb ...Unpacking libgsm1:amd64 (1.0.22-1) ...Selecting previously unselected package libhwy1:amd64.Preparing to unpack .../224-libhwy1_1.0.3-3+deb12u1_amd64.deb ...Unpacking libhwy1:amd64 (1.0.3-3+deb12u1) ...Selecting previously unselected package libjxl0.7:amd64.Preparing to unpack .../225-libjxl0.7_0.7.0-10+deb12u1_amd64.deb ...Unpacking libjxl0.7:amd64 (0.7.0-10+deb12u1) ...Selecting previously unselected package librsvg2-2:amd64.Preparing to unpack .../226-librsvg2-2_2.54.7+dfsg-1~deb12u1_amd64.deb ...Unpacking librsvg2-2:amd64 (2.54.7+dfsg-1~deb12u1) ...Selecting previously unselected package libshine3:amd64.Preparing to unpack .../227-libshine3_3.1.1-2_amd64.deb ...Unpacking libshine3:amd64 (3.1.1-2) ...Selecting previously unselected package libsnappy1v5:amd64.Preparing to unpack .../228-libsnappy1v5_1.1.9-3_amd64.deb ...Unpacking libsnappy1v5:amd64 (1.1.9-3) ...Selecting previously unselected package libsoxr0:amd64.Preparing to unpack .../229-libsoxr0_0.1.3-4_amd64.deb ...Unpacking libsoxr0:amd64 (0.1.3-4) ...Selecting previously unselected package libswresample4:amd64.Preparing to unpack .../230-libswresample4_7%3a5.1.9-0+deb12u1_amd64.deb ...Unpacking libswresample4:amd64 (7:5.1.9-0+deb12u1) ...Selecting previously unselected package libx264-164:amd64.Preparing to unpack .../231-libx264-164_2%3a0.164.3095+gitbaee400-3_amd64.deb ...Unpacking libx264-164:amd64 (2:0.164.3095+gitbaee400-3) ...Selecting previously unselected package libxvidcore4:amd64.Preparing to unpack .../232-libxvidcore4_2%3a1.3.7-1_amd64.deb ...Unpacking libxvidcore4:amd64 (2:1.3.7-1) ...Selecting previously unselected package libzvbi-common.Preparing to unpack .../233-libzvbi-common_0.2.41-1+deb12u1_all.deb ...Unpacking libzvbi-common (0.2.41-1+deb12u1) ...Selecting previously unselected package libzvbi0:amd64.Preparing to unpack .../234-libzvbi0_0.2.41-1+deb12u1_amd64.deb ...Unpacking libzvbi0:amd64 (0.2.41-1+deb12u1) ...Selecting previously unselected package libavcodec59:amd64.Preparing to unpack .../235-libavcodec59_7%3a5.1.9-0+deb12u1_amd64.deb ...Unpacking libavcodec59:amd64 (7:5.1.9-0+deb12u1) ...Selecting previously unselected package libass9:amd64.Preparing to unpack .../236-libass9_1%3a0.17.1-1+deb12u1_amd64.deb ...Unpacking libass9:amd64 (1:0.17.1-1+deb12u1) ...Selecting previously unselected package libudfread0:amd64.Preparing to unpack .../237-libudfread0_1.1.2-1_amd64.deb ...Unpacking libudfread0:amd64 (1.1.2-1) ...Selecting previously unselected package libbluray2:amd64.Preparing to unpack .../238-libbluray2_1%3a1.3.4-1_amd64.deb ...Unpacking libbluray2:amd64 (1:1.3.4-1) ...Selecting previously unselected package libchromaprint1:amd64.Preparing to unpack .../239-libchromaprint1_1.5.1-2+b1_amd64.deb ...Unpacking libchromaprint1:amd64 (1.5.1-2+b1) ...Selecting previously unselected package libgme0:amd64.Preparing to unpack .../240-libgme0_0.6.3-6_amd64.deb ...Unpacking libgme0:amd64 (0.6.3-6) ...Selecting previously unselected package libvorbisfile3:amd64.Preparing to unpack .../241-libvorbisfile3_1.3.7-1_amd64.deb ...Unpacking libvorbisfile3:amd64 (1.3.7-1) ...Selecting previously unselected package libopenmpt0:amd64.Preparing to unpack .../242-libopenmpt0_0.6.9-1_amd64.deb ...Unpacking libopenmpt0:amd64 (0.6.9-1) ...Selecting previously unselected package librabbitmq4:amd64.Preparing to unpack .../243-librabbitmq4_0.11.0-1+deb12u3_amd64.deb ...Unpacking librabbitmq4:amd64 (0.11.0-1+deb12u3) ...Selecting previously unselected package libcjson1:amd64.Preparing to unpack .../244-libcjson1_1.7.15-1+deb12u4_amd64.deb ...Unpacking libcjson1:amd64 (1.7.15-1+deb12u4) ...Selecting previously unselected package libmbedcrypto7:amd64.Preparing to unpack .../245-libmbedcrypto7_2.28.3-1_amd64.deb ...Unpacking libmbedcrypto7:amd64 (2.28.3-1) ...Selecting previously unselected package librist4:amd64.Preparing to unpack .../246-librist4_0.2.7+dfsg-1_amd64.deb ...Unpacking librist4:amd64 (0.2.7+dfsg-1) ...Selecting previously unselected package libsrt1.5-gnutls:amd64.Preparing to unpack .../247-libsrt1.5-gnutls_1.5.1-1+deb12u1_amd64.deb ...Unpacking libsrt1.5-gnutls:amd64 (1.5.1-1+deb12u1) ...Selecting previously unselected package libssh-gcrypt-4:amd64.Preparing to unpack .../248-libssh-gcrypt-4_0.10.6-0+deb12u3_amd64.deb ...Unpacking libssh-gcrypt-4:amd64 (0.10.6-0+deb12u3) ...Selecting previously unselected package libnorm1:amd64.Preparing to unpack .../249-libnorm1_1.5.9+dfsg-2_amd64.deb ...Unpacking libnorm1:amd64 (1.5.9+dfsg-2) ...Selecting previously unselected package libpgm-5.3-0:amd64.Preparing to unpack .../250-libpgm-5.3-0_5.3.128~dfsg-2_amd64.deb ...Unpacking libpgm-5.3-0:amd64 (5.3.128~dfsg-2) ...Selecting previously unselected package libsodium23:amd64.Preparing to unpack .../251-libsodium23_1.0.18-1+deb12u1_amd64.deb ...Unpacking libsodium23:amd64 (1.0.18-1+deb12u1) ...Selecting previously unselected package libzmq5:amd64.Preparing to unpack .../252-libzmq5_4.3.4-6_amd64.deb ...Unpacking libzmq5:amd64 (4.3.4-6) ...Selecting previously unselected package libavformat59:amd64.Preparing to unpack .../253-libavformat59_7%3a5.1.9-0+deb12u1_amd64.deb ...Unpacking libavformat59:amd64 (7:5.1.9-0+deb12u1) ...Selecting previously unselected package libbs2b0:amd64.Preparing to unpack .../254-libbs2b0_3.1.0+dfsg-7_amd64.deb ...Unpacking libbs2b0:amd64 (3.1.0+dfsg-7) ...Selecting previously unselected package libserd-0-0:amd64.Preparing to unpack .../255-libserd-0-0_0.30.16-1_amd64.deb ...Unpacking libserd-0-0:amd64 (0.30.16-1) ...Selecting previously unselected package libsord-0-0:amd64.Preparing to unpack .../256-libsord-0-0_0.16.14+git221008-1_amd64.deb ...Unpacking libsord-0-0:amd64 (0.16.14+git221008-1) ...Selecting previously unselected package libsratom-0-0:amd64.Preparing to unpack .../257-libsratom-0-0_0.6.14-1_amd64.deb ...Unpacking libsratom-0-0:amd64 (0.6.14-1) ...Selecting previously unselected package liblilv-0-0:amd64.Preparing to unpack .../258-liblilv-0-0_0.24.14-1_amd64.deb ...Unpacking liblilv-0-0:amd64 (0.24.14-1) ...Selecting previously unselected package libmysofa1:amd64.Preparing to unpack .../259-libmysofa1_1.3.1~dfsg0-1_amd64.deb ...Unpacking libmysofa1:amd64 (1.3.1~dfsg0-1) ...Selecting previously unselected package libvulkan1:amd64.Preparing to unpack .../260-libvulkan1_1.3.239.0-1_amd64.deb ...Unpacking libvulkan1:amd64 (1.3.239.0-1) ...Selecting previously unselected package libplacebo208:amd64.Preparing to unpack .../261-libplacebo208_4.208.0-3_amd64.deb ...Unpacking libplacebo208:amd64 (4.208.0-3) ...Selecting previously unselected package libblas3:amd64.Preparing to unpack .../262-libblas3_3.11.0-2_amd64.deb ...Unpacking libblas3:amd64 (3.11.0-2) ...Selecting previously unselected package libgfortran5:amd64.Preparing to unpack .../263-libgfortran5_12.2.0-14+deb12u1_amd64.deb ...Unpacking libgfortran5:amd64 (12.2.0-14+deb12u1) ...Selecting previously unselected package liblapack3:amd64.Preparing to unpack .../264-liblapack3_3.11.0-2_amd64.deb ...Unpacking liblapack3:amd64 (3.11.0-2) ...Selecting previously unselected package libsphinxbase3:amd64.Preparing to unpack .../265-libsphinxbase3_0.8+5prealpha+1-16_amd64.deb ...Unpacking libsphinxbase3:amd64 (0.8+5prealpha+1-16) ...Selecting previously unselected package libpocketsphinx3:amd64.Preparing to unpack .../266-libpocketsphinx3_0.8+5prealpha+1-15_amd64.deb ...Unpacking libpocketsphinx3:amd64 (0.8+5prealpha+1-15) ...Selecting previously unselected package libpostproc56:amd64.Preparing to unpack .../267-libpostproc56_7%3a5.1.9-0+deb12u1_amd64.deb ...Unpacking libpostproc56:amd64 (7:5.1.9-0+deb12u1) ...Selecting previously unselected package librubberband2:amd64.Preparing to unpack .../268-librubberband2_3.1.2+dfsg0-1_amd64.deb ...Unpacking librubberband2:amd64 (3.1.2+dfsg0-1) ...Selecting previously unselected package libswscale6:amd64.Preparing to unpack .../269-libswscale6_7%3a5.1.9-0+deb12u1_amd64.deb ...Unpacking libswscale6:amd64 (7:5.1.9-0+deb12u1) ...Selecting previously unselected package libvidstab1.1:amd64.Preparing to unpack .../270-libvidstab1.1_1.1.0-2+b1_amd64.deb ...Unpacking libvidstab1.1:amd64 (1.1.0-2+b1) ...Selecting previously unselected package libzimg2:amd64.Preparing to unpack .../271-libzimg2_3.0.4+ds1-1_amd64.deb ...Unpacking libzimg2:amd64 (3.0.4+ds1-1) ...Selecting previously unselected package libavfilter8:amd64.Preparing to unpack .../272-libavfilter8_7%3a5.1.9-0+deb12u1_amd64.deb ...Unpacking libavfilter8:amd64 (7:5.1.9-0+deb12u1) ...Selecting previously unselected package gstreamer1.0-libav:amd64.Preparing to unpack .../273-gstreamer1.0-libav_1.22.0-2_amd64.deb ...Unpacking gstreamer1.0-libav:amd64 (1.22.0-2) ...Selecting previously unselected package libcurl3-gnutls:amd64.Preparing to unpack .../274-libcurl3-gnutls_7.88.1-10+deb12u15_amd64.deb ...Unpacking libcurl3-gnutls:amd64 (7.88.1-10+deb12u15) ...Selecting previously unselected package libusb-1.0-0:amd64.Preparing to unpack .../275-libusb-1.0-0_2%3a1.0.26-1_amd64.deb ...Unpacking libusb-1.0-0:amd64 (2:1.0.26-1) ...Selecting previously unselected package libdc1394-25:amd64.Preparing to unpack .../276-libdc1394-25_2.2.6-4_amd64.deb ...Unpacking libdc1394-25:amd64 (2.2.6-4) ...Selecting previously unselected package libdca0:amd64.Preparing to unpack .../277-libdca0_0.0.7-2_amd64.deb ...Unpacking libdca0:amd64 (0.0.7-2) ...Selecting previously unselected package libdirectfb-1.7-7:amd64.Preparing to unpack .../278-libdirectfb-1.7-7_1.7.7-11_amd64.deb ...Unpacking libdirectfb-1.7-7:amd64 (1.7.7-11) ...Selecting previously unselected package libdvdread8:amd64.Preparing to unpack .../279-libdvdread8_6.1.3-1_amd64.deb ...Unpacking libdvdread8:amd64 (6.1.3-1) ...Selecting previously unselected package libdvdnav4:amd64.Preparing to unpack .../280-libdvdnav4_6.1.1-1_amd64.deb ...Unpacking libdvdnav4:amd64 (6.1.1-1) ...Selecting previously unselected package libfaad2:amd64.Preparing to unpack .../281-libfaad2_2.10.1-1_amd64.deb ...Unpacking libfaad2:amd64 (2.10.1-1) ...Selecting previously unselected package libinstpatch-1.0-2:amd64.Preparing to unpack .../282-libinstpatch-1.0-2_1.1.6-1_amd64.deb ...Unpacking libinstpatch-1.0-2:amd64 (1.1.6-1) ...Selecting previously unselected package libdecor-0-0:amd64.Preparing to unpack .../283-libdecor-0-0_0.1.1-2_amd64.deb ...Unpacking libdecor-0-0:amd64 (0.1.1-2) ...Selecting previously unselected package libxss1:amd64.Preparing to unpack .../284-libxss1_1%3a1.2.3-1_amd64.deb ...Unpacking libxss1:amd64 (1:1.2.3-1) ...Selecting previously unselected package libsdl2-2.0-0:amd64.Preparing to unpack .../285-libsdl2-2.0-0_2.26.5+dfsg-1_amd64.deb ...Unpacking libsdl2-2.0-0:amd64 (2.26.5+dfsg-1) ...Selecting previously unselected package timgm6mb-soundfont.Preparing to unpack .../286-timgm6mb-soundfont_1.3-5_all.deb ...Unpacking timgm6mb-soundfont (1.3-5) ...Selecting previously unselected package libfluidsynth3:amd64.Preparing to unpack .../287-libfluidsynth3_2.3.1-2_amd64.deb ...Unpacking libfluidsynth3:amd64 (2.3.1-2) ...Selecting previously unselected package libfreeaptx0:amd64.Preparing to unpack .../288-libfreeaptx0_0.1.1-2_amd64.deb ...Unpacking libfreeaptx0:amd64 (0.1.1-2) ...Selecting previously unselected package libgssdp-1.6-0:amd64.Preparing to unpack .../289-libgssdp-1.6-0_1.6.2-2_amd64.deb ...Unpacking libgssdp-1.6-0:amd64 (1.6.2-2) ...Selecting previously unselected package libgupnp-1.6-0:amd64.Preparing to unpack .../290-libgupnp-1.6-0_1.6.3-1_amd64.deb ...Unpacking libgupnp-1.6-0:amd64 (1.6.3-1) ...Selecting previously unselected package libgupnp-igd-1.0-4:amd64.Preparing to unpack .../291-libgupnp-igd-1.0-4_1.2.0-3_amd64.deb ...Unpacking libgupnp-igd-1.0-4:amd64 (1.2.0-3) ...Selecting previously unselected package libnice10:amd64.Preparing to unpack .../292-libnice10_0.1.21-1_amd64.deb ...Unpacking libnice10:amd64 (0.1.21-1) ...Selecting previously unselected package libxcb-xkb1:amd64.Preparing to unpack .../293-libxcb-xkb1_1.15-1_amd64.deb ...Unpacking libxcb-xkb1:amd64 (1.15-1) ...Selecting previously unselected package libxkbcommon-x11-0:amd64.Preparing to unpack .../294-libxkbcommon-x11-0_1.5.0-1_amd64.deb ...Unpacking libxkbcommon-x11-0:amd64 (1.5.0-1) ...Selecting previously unselected package libgstreamer-plugins-bad1.0-0:amd64.Preparing to unpack .../295-libgstreamer-plugins-bad1.0-0_1.22.0-4+deb12u8_amd64.deb ...Unpacking libgstreamer-plugins-bad1.0-0:amd64 (1.22.0-4+deb12u8) ...Selecting previously unselected package libatk1.0-0:amd64.Preparing to unpack .../296-libatk1.0-0_2.46.0-5_amd64.deb ...Unpacking libatk1.0-0:amd64 (2.46.0-5) ...Selecting previously unselected package libatk-bridge2.0-0:amd64.Preparing to unpack .../297-libatk-bridge2.0-0_2.46.0-5_amd64.deb ...Unpacking libatk-bridge2.0-0:amd64 (2.46.0-5) ...Selecting previously unselected package libxcomposite1:amd64.Preparing to unpack .../298-libxcomposite1_1%3a0.4.5-1_amd64.deb ...Unpacking libxcomposite1:amd64 (1:0.4.5-1) ...Selecting previously unselected package libgtk-3-common.Preparing to unpack .../299-libgtk-3-common_3.24.38-2~deb12u3_all.deb ...Unpacking libgtk-3-common (3.24.38-2~deb12u3) ...Selecting previously unselected package libgtk-3-0:amd64.Preparing to unpack .../300-libgtk-3-0_3.24.38-2~deb12u3_amd64.deb ...Unpacking libgtk-3-0:amd64 (3.24.38-2~deb12u3) ...Selecting previously unselected package libimath-3-1-29:amd64.Preparing to unpack .../301-libimath-3-1-29_3.1.6-1_amd64.deb ...Unpacking libimath-3-1-29:amd64 (3.1.6-1) ...Selecting previously unselected package libkate1:amd64.Preparing to unpack .../302-libkate1_0.4.1-11_amd64.deb ...Unpacking libkate1:amd64 (0.4.1-11) ...Selecting previously unselected package libldacbt-enc2:amd64.Preparing to unpack .../303-libldacbt-enc2_2.0.2.3+git20200429+ed310a0-4_amd64.deb ...Unpacking libldacbt-enc2:amd64 (2.0.2.3+git20200429+ed310a0-4) ...Selecting previously unselected package libyajl2:amd64.Preparing to unpack .../304-libyajl2_2.1.0-3+deb12u2_amd64.deb ...Unpacking libyajl2:amd64 (2.1.0-3+deb12u2) ...Selecting previously unselected package libraptor2-0:amd64.Preparing to unpack .../305-libraptor2-0_2.0.15-4+deb12u1_amd64.deb ...Unpacking libraptor2-0:amd64 (2.0.15-4+deb12u1) ...Selecting previously unselected package liblrdf0:amd64.Preparing to unpack .../306-liblrdf0_0.6.1-4_amd64.deb ...Unpacking liblrdf0:amd64 (0.6.1-4) ...Selecting previously unselected package libltc11:amd64.Preparing to unpack .../307-libltc11_1.3.2-1_amd64.deb ...Unpacking libltc11:amd64 (1.3.2-1) ...Selecting previously unselected package libmjpegutils-2.1-0:amd64.Preparing to unpack .../308-libmjpegutils-2.1-0_1%3a2.1.0+debian-7_amd64.deb ...Unpacking libmjpegutils-2.1-0:amd64 (1:2.1.0+debian-7) ...Selecting previously unselected package libmodplug1:amd64.Preparing to unpack .../309-libmodplug1_1%3a0.8.9.0-3_amd64.deb ...Unpacking libmodplug1:amd64 (1:0.8.9.0-3) ...Selecting previously unselected package libmpcdec6:amd64.Preparing to unpack .../310-libmpcdec6_2%3a0.1~r495-2_amd64.deb ...Unpacking libmpcdec6:amd64 (2:0.1~r495-2) ...Selecting previously unselected package libmpeg2encpp-2.1-0:amd64.Preparing to unpack .../311-libmpeg2encpp-2.1-0_1%3a2.1.0+debian-7_amd64.deb ...Unpacking libmpeg2encpp-2.1-0:amd64 (1:2.1.0+debian-7) ...Selecting previously unselected package libmplex2-2.1-0:amd64.Preparing to unpack .../312-libmplex2-2.1-0_1%3a2.1.0+debian-7_amd64.deb ...Unpacking libmplex2-2.1-0:amd64 (1:2.1.0+debian-7) ...Selecting previously unselected package libneon27:amd64.Preparing to unpack .../313-libneon27_0.32.5-1_amd64.deb ...Unpacking libneon27:amd64 (0.32.5-1) ...Selecting previously unselected package libopenal-data.Preparing to unpack .../314-libopenal-data_1%3a1.19.1-2_all.deb ...Unpacking libopenal-data (1:1.19.1-2) ...Selecting previously unselected package libsndio7.0:amd64.Preparing to unpack .../315-libsndio7.0_1.9.0-0.3+b2_amd64.deb ...Unpacking libsndio7.0:amd64 (1.9.0-0.3+b2) ...Selecting previously unselected package libopenal1:amd64.Preparing to unpack .../316-libopenal1_1%3a1.19.1-2_amd64.deb ...Unpacking libopenal1:amd64 (1:1.19.1-2) ...Selecting previously unselected package libopenexr-3-1-30:amd64.Preparing to unpack .../317-libopenexr-3-1-30_3.1.5-5_amd64.deb ...Unpacking libopenexr-3-1-30:amd64 (3.1.5-5) ...Selecting previously unselected package libopenh264-7:amd64.Preparing to unpack .../318-libopenh264-7_2.3.1+dfsg-3+deb12u2_amd64.deb ...Unpacking libopenh264-7:amd64 (2.3.1+dfsg-3+deb12u2) ...Selecting previously unselected package libopenni2-0:amd64.Preparing to unpack .../319-libopenni2-0_2.2.0.33+dfsg-15+b1_amd64.deb ...Unpacking libopenni2-0:amd64 (2.2.0.33+dfsg-15+b1) ...Selecting previously unselected package libqrencode4:amd64.Preparing to unpack .../320-libqrencode4_4.1.1-1_amd64.deb ...Unpacking libqrencode4:amd64 (4.1.1-1) ...Selecting previously unselected package libsbc1:amd64.Preparing to unpack .../321-libsbc1_2.0-1_amd64.deb ...Unpacking libsbc1:amd64 (2.0-1) ...Selecting previously unselected package libsoundtouch1:amd64.Preparing to unpack .../322-libsoundtouch1_2.3.2+ds1-1_amd64.deb ...Unpacking libsoundtouch1:amd64 (2.3.2+ds1-1) ...Selecting previously unselected package libspandsp2:amd64.Preparing to unpack .../323-libspandsp2_0.0.6+dfsg-2+b1_amd64.deb ...Unpacking libspandsp2:amd64 (0.0.6+dfsg-2+b1) ...Selecting previously unselected package libsrtp2-1:amd64.Preparing to unpack .../324-libsrtp2-1_2.5.0-3_amd64.deb ...Unpacking libsrtp2-1:amd64 (2.5.0-3) ...Selecting previously unselected package libvo-aacenc0:amd64.Preparing to unpack .../325-libvo-aacenc0_0.1.3-2_amd64.deb ...Unpacking libvo-aacenc0:amd64 (0.1.3-2) ...Selecting previously unselected package libvo-amrwbenc0:amd64.Preparing to unpack .../326-libvo-amrwbenc0_0.1.3-2_amd64.deb ...Unpacking libvo-amrwbenc0:amd64 (0.1.3-2) ...Selecting previously unselected package libwebrtc-audio-processing1:amd64.Preparing to unpack .../327-libwebrtc-audio-processing1_0.3-1+b1_amd64.deb ...Unpacking libwebrtc-audio-processing1:amd64 (0.3-1+b1) ...Selecting previously unselected package libwildmidi2:amd64.Preparing to unpack .../328-libwildmidi2_0.4.3-1_amd64.deb ...Unpacking libwildmidi2:amd64 (0.4.3-1) ...Selecting previously unselected package libzbar0:amd64.Preparing to unpack .../329-libzbar0_0.23.92-7+deb12u1_amd64.deb ...Unpacking libzbar0:amd64 (0.23.92-7+deb12u1) ...Selecting previously unselected package libzxing2:amd64.Preparing to unpack .../330-libzxing2_1.4.0-3+b1_amd64.deb ...Unpacking libzxing2:amd64 (1.4.0-3+b1) ...Selecting previously unselected package gstreamer1.0-plugins-bad:amd64.Preparing to unpack .../331-gstreamer1.0-plugins-bad_1.22.0-4+deb12u8_amd64.deb ...Unpacking gstreamer1.0-plugins-bad:amd64 (1.22.0-4+deb12u8) ...Selecting previously unselected package libxv1:amd64.Preparing to unpack .../332-libxv1_2%3a1.0.11-1.1_amd64.deb ...Unpacking libxv1:amd64 (2:1.0.11-1.1) ...Selecting previously unselected package gstreamer1.0-x:amd64.Preparing to unpack .../333-gstreamer1.0-x_1.22.0-3+deb12u7_amd64.deb ...Unpacking gstreamer1.0-x:amd64 (1.22.0-3+deb12u7) ...Selecting previously unselected package i965-va-driver:amd64.Preparing to unpack .../334-i965-va-driver_2.4.1+dfsg1-1_amd64.deb ...Unpacking i965-va-driver:amd64 (2.4.1+dfsg1-1) ...Selecting previously unselected package icu-devtools.Preparing to unpack .../335-icu-devtools_72.1-3+deb12u1_amd64.deb ...Unpacking icu-devtools (72.1-3+deb12u1) ...Selecting previously unselected package libigdgmm12:amd64.Preparing to unpack .../336-libigdgmm12_22.3.3+ds1-1_amd64.deb ...Unpacking libigdgmm12:amd64 (22.3.3+ds1-1) ...Selecting previously unselected package intel-media-va-driver:amd64.Preparing to unpack .../337-intel-media-va-driver_23.1.1+dfsg1-1_amd64.deb ...Unpacking intel-media-va-driver:amd64 (23.1.1+dfsg1-1) ...Selecting previously unselected package libaacs0:amd64.Preparing to unpack .../338-libaacs0_0.11.1-2_amd64.deb ...Unpacking libaacs0:amd64 (0.11.1-2) ...Selecting previously unselected package libexpat1-dev:amd64.Preparing to unpack .../339-libexpat1-dev_2.5.0-1+deb12u5_amd64.deb ...Unpacking libexpat1-dev:amd64 (2.5.0-1+deb12u5) ...Selecting previously unselected package libbrotli-dev:amd64.Preparing to unpack .../340-libbrotli-dev_1.0.9-2+deb12u1_amd64.deb ...Unpacking libbrotli-dev:amd64 (1.0.9-2+deb12u1) ...Selecting previously unselected package zlib1g-dev:amd64.Preparing to unpack .../341-zlib1g-dev_1%3a1.2.13.dfsg-1_amd64.deb ...Unpacking zlib1g-dev:amd64 (1:1.2.13.dfsg-1) ...Selecting previously unselected package libpng-dev:amd64.Preparing to unpack .../342-libpng-dev_1.6.39-2+deb12u6_amd64.deb ...Unpacking libpng-dev:amd64 (1.6.39-2+deb12u6) ...Selecting previously unselected package libfreetype-dev:amd64.Preparing to unpack .../343-libfreetype-dev_2.12.1+dfsg-5+deb12u4_amd64.deb ...Unpacking libfreetype-dev:amd64 (2.12.1+dfsg-5+deb12u4) ...Selecting previously unselected package uuid-dev:amd64.Preparing to unpack .../344-uuid-dev_2.38.1-5+deb12u3_amd64.deb ...Unpacking uuid-dev:amd64 (2.38.1-5+deb12u3) ...Selecting previously unselected package libpkgconf3:amd64.Preparing to unpack .../345-libpkgconf3_1.8.1-1_amd64.deb ...Unpacking libpkgconf3:amd64 (1.8.1-1) ...Selecting previously unselected package pkgconf-bin.Preparing to unpack .../346-pkgconf-bin_1.8.1-1_amd64.deb ...Unpacking pkgconf-bin (1.8.1-1) ...Selecting previously unselected package pkgconf:amd64.Preparing to unpack .../347-pkgconf_1.8.1-1_amd64.deb ...Unpacking pkgconf:amd64 (1.8.1-1) ...Selecting previously unselected package pkg-config:amd64.Preparing to unpack .../348-pkg-config_1.8.1-1_amd64.deb ...Unpacking pkg-config:amd64 (1.8.1-1) ...Selecting previously unselected package libfontconfig-dev:amd64.Preparing to unpack .../349-libfontconfig-dev_2.14.1-4_amd64.deb ...Unpacking libfontconfig-dev:amd64 (2.14.1-4) ...Selecting previously unselected package libffi-dev:amd64.Preparing to unpack .../350-libffi-dev_3.4.4-1_amd64.deb ...Unpacking libffi-dev:amd64 (3.4.4-1) ...Selecting previously unselected package libglib2.0-data.Preparing to unpack .../351-libglib2.0-data_2.74.6-2+deb12u9_all.deb ...Unpacking libglib2.0-data (2.74.6-2+deb12u9) ...Selecting previously unselected package libglib2.0-bin.Preparing to unpack .../352-libglib2.0-bin_2.74.6-2+deb12u9_amd64.deb ...Unpacking libglib2.0-bin (2.74.6-2+deb12u9) ...Selecting previously unselected package libglib2.0-dev-bin.Preparing to unpack .../353-libglib2.0-dev-bin_2.74.6-2+deb12u9_amd64.deb ...Unpacking libglib2.0-dev-bin (2.74.6-2+deb12u9) ...Selecting previously unselected package libblkid-dev:amd64.Preparing to unpack .../354-libblkid-dev_2.38.1-5+deb12u3_amd64.deb ...Unpacking libblkid-dev:amd64 (2.38.1-5+deb12u3) ...Selecting previously unselected package libsepol-dev:amd64.Preparing to unpack .../355-libsepol-dev_3.4-2.1_amd64.deb ...Unpacking libsepol-dev:amd64 (3.4-2.1) ...Selecting previously unselected package libpcre2-16-0:amd64.Preparing to unpack .../356-libpcre2-16-0_10.42-1+deb12u2_amd64.deb ...Unpacking libpcre2-16-0:amd64 (10.42-1+deb12u2) ...Selecting previously unselected package libpcre2-32-0:amd64.Preparing to unpack .../357-libpcre2-32-0_10.42-1+deb12u2_amd64.deb ...Unpacking libpcre2-32-0:amd64 (10.42-1+deb12u2) ...Selecting previously unselected package libpcre2-posix3:amd64.Preparing to unpack .../358-libpcre2-posix3_10.42-1+deb12u2_amd64.deb ...Unpacking libpcre2-posix3:amd64 (10.42-1+deb12u2) ...Selecting previously unselected package libpcre2-dev:amd64.Preparing to unpack .../359-libpcre2-dev_10.42-1+deb12u2_amd64.deb ...Unpacking libpcre2-dev:amd64 (10.42-1+deb12u2) ...Selecting previously unselected package libselinux1-dev:amd64.Preparing to unpack .../360-libselinux1-dev_3.4-1+b6_amd64.deb ...Unpacking libselinux1-dev:amd64 (3.4-1+b6) ...Selecting previously unselected package libmount-dev:amd64.Preparing to unpack .../361-libmount-dev_2.38.1-5+deb12u3_amd64.deb ...Unpacking libmount-dev:amd64 (2.38.1-5+deb12u3) ...Selecting previously unselected package libglib2.0-dev:amd64.Preparing to unpack .../362-libglib2.0-dev_2.74.6-2+deb12u9_amd64.deb ...Unpacking libglib2.0-dev:amd64 (2.74.6-2+deb12u9) ...Selecting previously unselected package libpixman-1-dev:amd64.Preparing to unpack .../363-libpixman-1-dev_0.42.2-1_amd64.deb ...Unpacking libpixman-1-dev:amd64 (0.42.2-1) ...Selecting previously unselected package xorg-sgml-doctools.Preparing to unpack .../364-xorg-sgml-doctools_1%3a1.11-1.1_all.deb ...Unpacking xorg-sgml-doctools (1:1.11-1.1) ...Selecting previously unselected package x11proto-dev.Preparing to unpack .../365-x11proto-dev_2022.1-1_all.deb ...Unpacking x11proto-dev (2022.1-1) ...Selecting previously unselected package x11proto-core-dev.Preparing to unpack .../366-x11proto-core-dev_2022.1-1_all.deb ...Unpacking x11proto-core-dev (2022.1-1) ...Selecting previously unselected package libice-dev:amd64.Preparing to unpack .../367-libice-dev_2%3a1.0.10-1_amd64.deb ...Unpacking libice-dev:amd64 (2:1.0.10-1) ...Selecting previously unselected package libsm-dev:amd64.Preparing to unpack .../368-libsm-dev_2%3a1.2.3-1_amd64.deb ...Unpacking libsm-dev:amd64 (2:1.2.3-1) ...Selecting previously unselected package libxau-dev:amd64.Preparing to unpack .../369-libxau-dev_1%3a1.0.9-1_amd64.deb ...Unpacking libxau-dev:amd64 (1:1.0.9-1) ...Selecting previously unselected package libxdmcp-dev:amd64.Preparing to unpack .../370-libxdmcp-dev_1%3a1.1.2-3_amd64.deb ...Unpacking libxdmcp-dev:amd64 (1:1.1.2-3) ...Selecting previously unselected package xtrans-dev.Preparing to unpack .../371-xtrans-dev_1.4.0-1_all.deb ...Unpacking xtrans-dev (1.4.0-1) ...Selecting previously unselected package libpthread-stubs0-dev:amd64.Preparing to unpack .../372-libpthread-stubs0-dev_0.4-1_amd64.deb ...Unpacking libpthread-stubs0-dev:amd64 (0.4-1) ...Selecting previously unselected package libxcb1-dev:amd64.Preparing to unpack .../373-libxcb1-dev_1.15-1_amd64.deb ...Unpacking libxcb1-dev:amd64 (1.15-1) ...Selecting previously unselected package libx11-dev:amd64.Preparing to unpack .../374-libx11-dev_2%3a1.8.4-2+deb12u2_amd64.deb ...Unpacking libx11-dev:amd64 (2:1.8.4-2+deb12u2) ...Selecting previously unselected package libxcb-render0-dev:amd64.Preparing to unpack .../375-libxcb-render0-dev_1.15-1_amd64.deb ...Unpacking libxcb-render0-dev:amd64 (1.15-1) ...Selecting previously unselected package libxcb-shm0-dev:amd64.Preparing to unpack .../376-libxcb-shm0-dev_1.15-1_amd64.deb ...Unpacking libxcb-shm0-dev:amd64 (1.15-1) ...Selecting previously unselected package libxext-dev:amd64.Preparing to unpack .../377-libxext-dev_2%3a1.3.4-1+b1_amd64.deb ...Unpacking libxext-dev:amd64 (2:1.3.4-1+b1) ...Selecting previously unselected package libxrender-dev:amd64.Preparing to unpack .../378-libxrender-dev_1%3a0.9.10-1.1_amd64.deb ...Unpacking libxrender-dev:amd64 (1:0.9.10-1.1) ...Selecting previously unselected package libcairo2-dev:amd64.Preparing to unpack .../379-libcairo2-dev_1.16.0-7_amd64.deb ...Unpacking libcairo2-dev:amd64 (1.16.0-7) ...Selecting previously unselected package libglx-dev:amd64.Preparing to unpack .../380-libglx-dev_1.6.0-1_amd64.deb ...Unpacking libglx-dev:amd64 (1.6.0-1) ...Selecting previously unselected package libgl-dev:amd64.Preparing to unpack .../381-libgl-dev_1.6.0-1_amd64.deb ...Unpacking libgl-dev:amd64 (1.6.0-1) ...Selecting previously unselected package libegl-dev:amd64.Preparing to unpack .../382-libegl-dev_1.6.0-1_amd64.deb ...Unpacking libegl-dev:amd64 (1.6.0-1) ...Selecting previously unselected package libglvnd-core-dev:amd64.Preparing to unpack .../383-libglvnd-core-dev_1.6.0-1_amd64.deb ...Unpacking libglvnd-core-dev:amd64 (1.6.0-1) ...Selecting previously unselected package libgles1:amd64.Preparing to unpack .../384-libgles1_1.6.0-1_amd64.deb ...Unpacking libgles1:amd64 (1.6.0-1) ...Selecting previously unselected package libgles-dev:amd64.Preparing to unpack .../385-libgles-dev_1.6.0-1_amd64.deb ...Unpacking libgles-dev:amd64 (1.6.0-1) ...Selecting previously unselected package libopengl0:amd64.Preparing to unpack .../386-libopengl0_1.6.0-1_amd64.deb ...Unpacking libopengl0:amd64 (1.6.0-1) ...Selecting previously unselected package libopengl-dev:amd64.Preparing to unpack .../387-libopengl-dev_1.6.0-1_amd64.deb ...Unpacking libopengl-dev:amd64 (1.6.0-1) ...Selecting previously unselected package libglvnd-dev:amd64.Preparing to unpack .../388-libglvnd-dev_1.6.0-1_amd64.deb ...Unpacking libglvnd-dev:amd64 (1.6.0-1) ...Selecting previously unselected package libegl1-mesa-dev:amd64.Preparing to unpack .../389-libegl1-mesa-dev_22.3.6-1+deb12u2_amd64.deb ...Unpacking libegl1-mesa-dev:amd64 (22.3.6-1+deb12u2) ...Selecting previously unselected package libepoxy-dev:amd64.Preparing to unpack .../390-libepoxy-dev_1.5.10-1_amd64.deb ...Unpacking libepoxy-dev:amd64 (1.5.10-1) ...Selecting previously unselected package libgdk-pixbuf2.0-bin.Preparing to unpack .../391-libgdk-pixbuf2.0-bin_2.42.10+dfsg-1+deb12u4_amd64.deb ...Unpacking libgdk-pixbuf2.0-bin (2.42.10+dfsg-1+deb12u4) ...Selecting previously unselected package libjpeg62-turbo-dev:amd64.Preparing to unpack .../392-libjpeg62-turbo-dev_1%3a2.1.5-2_amd64.deb ...Unpacking libjpeg62-turbo-dev:amd64 (1:2.1.5-2) ...Selecting previously unselected package libjpeg-dev:amd64.Preparing to unpack .../393-libjpeg-dev_1%3a2.1.5-2_amd64.deb ...Unpacking libjpeg-dev:amd64 (1:2.1.5-2) ...Selecting previously unselected package libjbig-dev:amd64.Preparing to unpack .../394-libjbig-dev_2.1-6.1_amd64.deb ...Unpacking libjbig-dev:amd64 (2.1-6.1) ...Selecting previously unselected package liblzma-dev:amd64.Preparing to unpack .../395-liblzma-dev_5.4.1-1+deb12u2_amd64.deb ...Unpacking liblzma-dev:amd64 (5.4.1-1+deb12u2) ...Selecting previously unselected package libzstd-dev:amd64.Preparing to unpack .../396-libzstd-dev_1.5.4+dfsg2-5_amd64.deb ...Unpacking libzstd-dev:amd64 (1.5.4+dfsg2-5) ...Selecting previously unselected package libwebp-dev:amd64.Preparing to unpack .../397-libwebp-dev_1.2.4-0.2+deb12u1_amd64.deb ...Unpacking libwebp-dev:amd64 (1.2.4-0.2+deb12u1) ...Selecting previously unselected package libtiffxx6:amd64.Preparing to unpack .../398-libtiffxx6_4.5.0-6+deb12u4_amd64.deb ...Unpacking libtiffxx6:amd64 (4.5.0-6+deb12u4) ...Selecting previously unselected package libdeflate-dev:amd64.Preparing to unpack .../399-libdeflate-dev_1.14-1_amd64.deb ...Unpacking libdeflate-dev:amd64 (1.14-1) ...Selecting previously unselected package liblerc-dev:amd64.Preparing to unpack .../400-liblerc-dev_4.0.0+ds-2_amd64.deb ...Unpacking liblerc-dev:amd64 (4.0.0+ds-2) ...Selecting previously unselected package libtiff-dev:amd64.Preparing to unpack .../401-libtiff-dev_4.5.0-6+deb12u4_amd64.deb ...Unpacking libtiff-dev:amd64 (4.5.0-6+deb12u4) ...Selecting previously unselected package libgdk-pixbuf-2.0-dev:amd64.Preparing to unpack .../402-libgdk-pixbuf-2.0-dev_2.42.10+dfsg-1+deb12u4_amd64.deb ...Unpacking libgdk-pixbuf-2.0-dev:amd64 (2.42.10+dfsg-1+deb12u4) ...Selecting previously unselected package libgirepository1.0-dev.Preparing to unpack .../403-libgirepository1.0-dev_1.74.0-3_amd64.deb ...Unpacking libgirepository1.0-dev (1.74.0-3) ...Selecting previously unselected package libgraphene-1.0-dev.Preparing to unpack .../404-libgraphene-1.0-dev_1.10.8-1_amd64.deb ...Unpacking libgraphene-1.0-dev (1.10.8-1) ...Selecting previously unselected package libfribidi-dev:amd64.Preparing to unpack .../405-libfribidi-dev_1.0.8-2.1_amd64.deb ...Unpacking libfribidi-dev:amd64 (1.0.8-2.1) ...Selecting previously unselected package libharfbuzz-gobject0:amd64.Preparing to unpack .../406-libharfbuzz-gobject0_6.0.0+dfsg-3_amd64.deb ...Unpacking libharfbuzz-gobject0:amd64 (6.0.0+dfsg-3) ...Selecting previously unselected package libharfbuzz-subset0:amd64.Preparing to unpack .../407-libharfbuzz-subset0_6.0.0+dfsg-3_amd64.deb ...Unpacking libharfbuzz-subset0:amd64 (6.0.0+dfsg-3) ...Selecting previously unselected package libgraphite2-dev:amd64.Preparing to unpack .../408-libgraphite2-dev_1.3.14-1+deb12u1_amd64.deb ...Unpacking libgraphite2-dev:amd64 (1.3.14-1+deb12u1) ...Selecting previously unselected package libicu-dev:amd64.Preparing to unpack .../409-libicu-dev_72.1-3+deb12u1_amd64.deb ...Unpacking libicu-dev:amd64 (72.1-3+deb12u1) ...Selecting previously unselected package libharfbuzz-dev:amd64.Preparing to unpack .../410-libharfbuzz-dev_6.0.0+dfsg-3_amd64.deb ...Unpacking libharfbuzz-dev:amd64 (6.0.0+dfsg-3) ...Selecting previously unselected package libdatrie-dev:amd64.Preparing to unpack .../411-libdatrie-dev_0.2.13-2+b1_amd64.deb ...Unpacking libdatrie-dev:amd64 (0.2.13-2+b1) ...Selecting previously unselected package libthai-dev:amd64.Preparing to unpack .../412-libthai-dev_0.1.29-1_amd64.deb ...Unpacking libthai-dev:amd64 (0.1.29-1) ...Selecting previously unselected package libxft-dev:amd64.Preparing to unpack .../413-libxft-dev_2.3.6-1_amd64.deb ...Unpacking libxft-dev:amd64 (2.3.6-1) ...Selecting previously unselected package pango1.0-tools.Preparing to unpack .../414-pango1.0-tools_1.50.12+ds-1_amd64.deb ...Unpacking pango1.0-tools (1.50.12+ds-1) ...Selecting previously unselected package libpango1.0-dev:amd64.Preparing to unpack .../415-libpango1.0-dev_1.50.12+ds-1_amd64.deb ...Unpacking libpango1.0-dev:amd64 (1.50.12+ds-1) ...Selecting previously unselected package libwayland-bin.Preparing to unpack .../416-libwayland-bin_1.21.0-1_amd64.deb ...Unpacking libwayland-bin (1.21.0-1) ...Selecting previously unselected package libwayland-dev:amd64.Preparing to unpack .../417-libwayland-dev_1.21.0-1_amd64.deb ...Unpacking libwayland-dev:amd64 (1.21.0-1) ...Selecting previously unselected package libxfixes-dev:amd64.Preparing to unpack .../418-libxfixes-dev_1%3a6.0.0-2_amd64.deb ...Unpacking libxfixes-dev:amd64 (1:6.0.0-2) ...Selecting previously unselected package libxcomposite-dev:amd64.Preparing to unpack .../419-libxcomposite-dev_1%3a0.4.5-1_amd64.deb ...Unpacking libxcomposite-dev:amd64 (1:0.4.5-1) ...Selecting previously unselected package libxcursor-dev:amd64.Preparing to unpack .../420-libxcursor-dev_1%3a1.2.1-1_amd64.deb ...Unpacking libxcursor-dev:amd64 (1:1.2.1-1) ...Selecting previously unselected package libxdamage-dev:amd64.Preparing to unpack .../421-libxdamage-dev_1%3a1.1.6-1_amd64.deb ...Unpacking libxdamage-dev:amd64 (1:1.1.6-1) ...Selecting previously unselected package libxi-dev:amd64.Preparing to unpack .../422-libxi-dev_2%3a1.8-1+b1_amd64.deb ...Unpacking libxi-dev:amd64 (2:1.8-1+b1) ...Selecting previously unselected package libxinerama-dev:amd64.Preparing to unpack .../423-libxinerama-dev_2%3a1.1.4-3_amd64.deb ...Unpacking libxinerama-dev:amd64 (2:1.1.4-3) ...Selecting previously unselected package libxkbcommon-dev:amd64.Preparing to unpack .../424-libxkbcommon-dev_1.5.0-1_amd64.deb ...Unpacking libxkbcommon-dev:amd64 (1.5.0-1) ...Selecting previously unselected package libxrandr-dev:amd64.Preparing to unpack .../425-libxrandr-dev_2%3a1.5.2-2+b1_amd64.deb ...Unpacking libxrandr-dev:amd64 (2:1.5.2-2+b1) ...Selecting previously unselected package libvulkan-dev:amd64.Preparing to unpack .../426-libvulkan-dev_1.3.239.0-1_amd64.deb ...Unpacking libvulkan-dev:amd64 (1.3.239.0-1) ...Selecting previously unselected package wayland-protocols.Preparing to unpack .../427-wayland-protocols_1.31-1_all.deb ...Unpacking wayland-protocols (1.31-1) ...Selecting previously unselected package libgtk-4-dev:amd64.Preparing to unpack .../428-libgtk-4-dev_4.8.3+ds-2+deb12u1_amd64.deb ...Unpacking libgtk-4-dev:amd64 (4.8.3+ds-2+deb12u1) ...Selecting previously unselected package libadwaita-1-dev:amd64.Preparing to unpack .../429-libadwaita-1-dev_1.2.2-1_amd64.deb ...Unpacking libadwaita-1-dev:amd64 (1.2.2-1) ...Selecting previously unselected package libbdplus0:amd64.Preparing to unpack .../430-libbdplus0_0.2.0-3_amd64.deb ...Unpacking libbdplus0:amd64 (0.2.0-3) ...Selecting previously unselected package libdecor-0-plugin-1-cairo:amd64.Preparing to unpack .../431-libdecor-0-plugin-1-cairo_0.1.1-2_amd64.deb ...Unpacking libdecor-0-plugin-1-cairo:amd64 (0.1.1-2) ...Selecting previously unselected package libdjvulibre-text.Preparing to unpack .../432-libdjvulibre-text_3.5.28-2.2~deb12u1_all.deb ...Unpacking libdjvulibre-text (3.5.28-2.2~deb12u1) ...Selecting previously unselected package libdjvulibre21:amd64.Preparing to unpack .../433-libdjvulibre21_3.5.28-2.2~deb12u1_amd64.deb ...Unpacking libdjvulibre21:amd64 (3.5.28-2.2~deb12u1) ...Selecting previously unselected package libgtk-3-bin.Preparing to unpack .../434-libgtk-3-bin_3.24.38-2~deb12u3_amd64.deb ...Unpacking libgtk-3-bin (3.24.38-2~deb12u3) ...Selecting previously unselected package libgtk-4-bin.Preparing to unpack .../435-libgtk-4-bin_4.8.3+ds-2+deb12u1_amd64.deb ...Unpacking libgtk-4-bin (4.8.3+ds-2+deb12u1) ...Selecting previously unselected package libjavascriptcoregtk-6.0-dev:amd64.Preparing to unpack .../436-libjavascriptcoregtk-6.0-dev_2.50.6-1~deb12u2_amd64.deb ...Unpacking libjavascriptcoregtk-6.0-dev:amd64 (2.50.6-1~deb12u2) ...Selecting previously unselected package libjson-glib-dev:amd64.Preparing to unpack .../437-libjson-glib-dev_1.6.6-1_amd64.deb ...Unpacking libjson-glib-dev:amd64 (1.6.6-1) ...Selecting previously unselected package libjxr0:amd64.Preparing to unpack .../438-libjxr0_1.2~git20170615.f752187-5_amd64.deb ...Unpacking libjxr0:amd64 (1.2~git20170615.f752187-5) ...Selecting previously unselected package libjxr-tools.Preparing to unpack .../439-libjxr-tools_1.2~git20170615.f752187-5_amd64.deb ...Unpacking libjxr-tools (1.2~git20170615.f752187-5) ...Selecting previously unselected package libwmflite-0.2-7:amd64.Preparing to unpack .../440-libwmflite-0.2-7_0.2.12-5.1_amd64.deb ...Unpacking libwmflite-0.2-7:amd64 (0.2.12-5.1) ...Selecting previously unselected package libmagickcore-6.q16-6-extra:amd64.Preparing to unpack .../441-libmagickcore-6.q16-6-extra_8%3a6.9.11.60+dfsg-1.6+deb12u14_amd64.deb ...Unpacking libmagickcore-6.q16-6-extra:amd64 (8:6.9.11.60+dfsg-1.6+deb12u14) ...Selecting previously unselected package libnghttp2-dev:amd64.Preparing to unpack .../442-libnghttp2-dev_1.52.0-1+deb12u3_amd64.deb ...Unpacking libnghttp2-dev:amd64 (1.52.0-1+deb12u3) ...Selecting previously unselected package libpaper-utils.Preparing to unpack .../443-libpaper-utils_1.1.29_amd64.deb ...Unpacking libpaper-utils (1.1.29) ...Selecting previously unselected package libspa-0.2-modules:amd64.Preparing to unpack .../444-libspa-0.2-modules_0.3.65-3+deb12u1_amd64.deb ...Unpacking libspa-0.2-modules:amd64 (0.3.65-3+deb12u1) ...Selecting previously unselected package libpipewire-0.3-0:amd64.Preparing to unpack .../445-libpipewire-0.3-0_0.3.65-3+deb12u1_amd64.deb ...Unpacking libpipewire-0.3-0:amd64 (0.3.65-3+deb12u1) ...Selecting previously unselected package libpipewire-0.3-common.Preparing to unpack .../446-libpipewire-0.3-common_0.3.65-3+deb12u1_all.deb ...Unpacking libpipewire-0.3-common (0.3.65-3+deb12u1) ...Selecting previously unselected package libpng-tools.Preparing to unpack .../447-libpng-tools_1.6.39-2+deb12u6_amd64.deb ...Unpacking libpng-tools (1.6.39-2+deb12u6) ...Selecting previously unselected package libpolkit-gobject-1-dev.Preparing to unpack .../448-libpolkit-gobject-1-dev_122-3_amd64.deb ...Unpacking libpolkit-gobject-1-dev (122-3) ...Selecting previously unselected package libpsl-dev:amd64.Preparing to unpack .../449-libpsl-dev_0.21.2-1_amd64.deb ...Unpacking libpsl-dev:amd64 (0.21.2-1) ...Selecting previously unselected package librsvg2-common:amd64.Preparing to unpack .../450-librsvg2-common_2.54.7+dfsg-1~deb12u1_amd64.deb ...Unpacking librsvg2-common:amd64 (2.54.7+dfsg-1~deb12u1) ...Selecting previously unselected package libsqlite3-dev:amd64.Preparing to unpack .../451-libsqlite3-dev_3.40.1-2+deb12u2_amd64.deb ...Unpacking libsqlite3-dev:amd64 (3.40.1-2+deb12u2) ...Selecting previously unselected package libsysprof-4:amd64.Preparing to unpack .../452-libsysprof-4_3.46.0-4_amd64.deb ...Unpacking libsysprof-4:amd64 (3.46.0-4) ...Selecting previously unselected package libsysprof-ui-5:amd64.Preparing to unpack .../453-libsysprof-ui-5_3.46.0-4_amd64.deb ...Unpacking libsysprof-ui-5:amd64 (3.46.0-4) ...Selecting previously unselected package libsysprof-4-dev:amd64.Preparing to unpack .../454-libsysprof-4-dev_3.46.0-4_amd64.deb ...Unpacking libsysprof-4-dev:amd64 (3.46.0-4) ...Selecting previously unselected package libsoup-3.0-dev:amd64.Preparing to unpack .../455-libsoup-3.0-dev_3.2.3-0+deb12u2_amd64.deb ...Unpacking libsoup-3.0-dev:amd64 (3.2.3-0+deb12u2) ...Selecting previously unselected package libvdpau-va-gl1:amd64.Preparing to unpack .../456-libvdpau-va-gl1_0.4.2-1+b1_amd64.deb ...Unpacking libvdpau-va-gl1:amd64 (0.4.2-1+b1) ...Selecting previously unselected package libwebkitgtk-6.0-dev.Preparing to unpack .../457-libwebkitgtk-6.0-dev_2.50.6-1~deb12u2_amd64.deb ...Unpacking libwebkitgtk-6.0-dev (2.50.6-1~deb12u2) ...Selecting previously unselected package libyaml-0-2:amd64.Preparing to unpack .../458-libyaml-0-2_0.2.5-1_amd64.deb ...Unpacking libyaml-0-2:amd64 (0.2.5-1) ...Selecting previously unselected package mesa-va-drivers:amd64.Preparing to unpack .../459-mesa-va-drivers_22.3.6-1+deb12u2_amd64.deb ...Unpacking mesa-va-drivers:amd64 (22.3.6-1+deb12u2) ...Selecting previously unselected package mesa-vdpau-drivers:amd64.Preparing to unpack .../460-mesa-vdpau-drivers_22.3.6-1+deb12u2_amd64.deb ...Unpacking mesa-vdpau-drivers:amd64 (22.3.6-1+deb12u2) ...Selecting previously unselected package mesa-vulkan-drivers:amd64.Preparing to unpack .../461-mesa-vulkan-drivers_22.3.6-1+deb12u2_amd64.deb ...Unpacking mesa-vulkan-drivers:amd64 (22.3.6-1+deb12u2) ...Selecting previously unselected package pocketsphinx-en-us.Preparing to unpack .../462-pocketsphinx-en-us_0.8+5prealpha+1-15_all.deb ...Unpacking pocketsphinx-en-us (0.8+5prealpha+1-15) ...Selecting previously unselected package python3-pygments.Preparing to unpack .../463-python3-pygments_2.14.0+dfsg-1_all.deb ...Unpacking python3-pygments (2.14.0+dfsg-1) ...Selecting previously unselected package python3-yaml.Preparing to unpack .../464-python3-yaml_6.0-3+b2_amd64.deb ...Unpacking python3-yaml (6.0-3+b2) ...Selecting previously unselected package va-driver-all:amd64.Preparing to unpack .../465-va-driver-all_2.17.0-1_amd64.deb ...Unpacking va-driver-all:amd64 (2.17.0-1) ...Selecting previously unselected package vdpau-driver-all:amd64.Preparing to unpack .../466-vdpau-driver-all_1.5-2_amd64.deb ...Unpacking vdpau-driver-all:amd64 (1.5-2) ...Selecting previously unselected package xdg-desktop-portal.Preparing to unpack .../467-xdg-desktop-portal_1.16.0-2_amd64.deb ...Unpacking xdg-desktop-portal (1.16.0-2) ...Selecting previously unselected package xdg-desktop-portal-gtk.Preparing to unpack .../468-xdg-desktop-portal-gtk_1.14.1-1_amd64.deb ...Unpacking xdg-desktop-portal-gtk (1.14.1-1) ...Setting up libgme0:amd64 (0.6.3-6) ...Setting up python3-pkg-resources (66.1.1-1+deb12u2) ...Setting up libssh-gcrypt-4:amd64 (0.10.6-0+deb12u3) ...Setting up libpipewire-0.3-common (0.3.65-3+deb12u1) ...Setting up libexpat1:amd64 (2.5.0-1+deb12u5) ...Setting up bubblewrap (0.8.0-2+deb12u1) ...Setting up libtext-iconv-perl:amd64 (1.7-8) ...Setting up libpixman-1-0:amd64 (0.42.2-1) ...Setting up libfreeaptx0:amd64 (0.1.1-2) ...Setting up libudfread0:amd64 (1.1.2-1) ...Setting up libmodplug1:amd64 (1:0.8.9.0-3) ...Setting up libcdparanoia0:amd64 (3.10.2+debian-14) ...Setting up libwayland-server0:amd64 (1.21.0-1) ...Setting up libaom3:amd64 (3.6.0-1+deb12u3) ...Setting up libvo-amrwbenc0:amd64 (0.1.3-2) ...Setting up libpciaccess0:amd64 (0.17-2) ...Setting up libabsl20220623:amd64 (20220623.1-1+deb12u2) ...Setting up fontconfig (2.14.1-4) ...Regenerating fonts cache... done.Setting up libdw1:amd64 (0.188-2.1) ...Setting up librabbitmq4:amd64 (0.11.0-1+deb12u3) ...Setting up systemd-sysv (252.39-1~deb12u2) ...Setting up libxau6:amd64 (1:1.0.9-1) ...Setting up imagemagick-6-common (8:6.9.11.60+dfsg-1.6+deb12u14) ...Setting up libxdmcp6:amd64 (1:1.1.2-3) ...Setting up libraw1394-11:amd64 (2.1.2-2) ...Setting up libsbc1:amd64 (2.0-1) ...Setting up libproxy1v5:amd64 (0.4.18-1.2) ...Setting up libxcb1:amd64 (1.15-1) ...Setting up libtag1v5-vanilla:amd64 (1.13-2+deb12u1) ...Setting up libkate1:amd64 (0.4.1-11) ...Setting up libcodec2-1.0:amd64 (1.0.5-1) ...Setting up libsodium23:amd64 (1.0.18-1+deb12u1) ...Setting up libpixman-1-dev:amd64 (0.42.2-1) ...Setting up libgpm2:amd64 (1.20.7-10+b1) ...Setting up libicu72:amd64 (72.1-3+deb12u1) ...Setting up libmpg123-0:amd64 (1.31.2-1+deb12u1) ...Setting up libxcb-xfixes0:amd64 (1.15-1) ...Setting up libogg0:amd64 (1.3.5-3) ...Setting up liblerc4:amd64 (4.0.0+ds-2) ...Setting up libzstd-dev:amd64 (1.5.4+dfsg2-5) ...Setting up libspeex1:amd64 (1.2.1-2) ...Setting up fonts-noto-mono (20201225-1) ...Setting up libshine3:amd64 (3.1.1-2) ...Setting up libglvnd-core-dev:amd64 (1.6.0-1) ...Setting up hicolor-icon-theme (0.17-2) ...Setting up libwmflite-0.2-7:amd64 (0.2.12-5.1) ...Setting up libx264-164:amd64 (2:0.164.3095+gitbaee400-3) ...Setting up libtwolame0:amd64 (0.4.0-2) ...Setting up libqrencode4:amd64 (4.1.1-1) ...Setting up libhyphen0:amd64 (2.8.8-7) ...Setting up libdatrie1:amd64 (0.2.13-2+b1) ...Setting up libgsm1:amd64 (1.0.22-1) ...Setting up libvisual-0.4-0:amd64 (0.4.0-19) ...Setting up libxcb-render0:amd64 (1.15-1) ...Setting up libsoxr0:amd64 (0.1.3-4) ...Setting up libyaml-0-2:amd64 (0.2.5-1) ...Setting up libaspell15:amd64 (0.60.8-4+b1) ...Setting up libglvnd0:amd64 (1.6.0-1) ...Setting up libpgm-5.3-0:amd64 (5.3.128~dfsg-2) ...Setting up libijs-0.35:amd64 (0.35-15) ...Setting up libjxr0:amd64 (1.2~git20170615.f752187-5) ...Setting up libxcb-glx0:amd64 (1.15-1) ...Setting up libgs-common (10.0.0~dfsg-11+deb12u8) ...Setting up libbrotli1:amd64 (1.0.9-2+deb12u1) ...Setting up libsrtp2-1:amd64 (2.5.0-3) ...Setting up libgdk-pixbuf2.0-common (2.42.10+dfsg-1+deb12u4) ...Setting up libnorm1:amd64 (1.5.9+dfsg-2) ...Setting up libmysofa1:amd64 (1.3.1~dfsg0-1) ...Setting up libyajl2:amd64 (2.1.0-3+deb12u2) ...Setting up x11-common (1:7.7+23) ...debconf: unable to initialize frontend: Dialogdebconf: (No usable dialog-like program is installed, so the dialog based frontend cannot be used. at /usr/share/perl5/Debconf/FrontEnd/Dialog.pm line 78.)debconf: falling back to frontend: Readlinedebconf: unable to initialize frontend: Readlinedebconf: (This frontend requires a controlling tty.)debconf: falling back to frontend: Teletypeinvoke-rc.d: could not determine current runlevelinvoke-rc.d: policy-rc.d denied execution of restart.Setting up libsensors-config (1:3.6.0-7.1) ...Setting up libldacbt-enc2:amd64 (2.0.2.3+git20200429+ed310a0-4) ...Setting up libdeflate0:amd64 (1.14-1) ...Setting up libcloudproviders0:amd64 (0.3.1-2) ...Setting up libwebrtc-audio-processing1:amd64 (0.3-1+b1) ...Setting up libnss-systemd:amd64 (252.39-1~deb12u2) ...Setting up xkb-data (2.35.1-1) ...Setting up python3-yaml (6.0-3+b2) ...Setting up liblzo2-2:amd64 (2.10-2) ...Setting up libcurl3-gnutls:amd64 (7.88.1-10+deb12u15) ...Setting up libhwy1:amd64 (1.0.3-3+deb12u1) ...Setting up libxcb-shm0:amd64 (1.15-1) ...Setting up libharfbuzz-gobject0:amd64 (6.0.0+dfsg-3) ...Setting up libigdgmm12:amd64 (22.3.3+ds1-1) ...Setting up libsvtav1enc1:amd64 (1.4.1+dfsg-1) ...Setting up libsoup-3.0-common (3.2.3-0+deb12u2) ...Setting up libimath-3-1-29:amd64 (3.1.6-1) ...Setting up libcjson1:amd64 (1.7.15-1+deb12u4) ...Setting up libxvidcore4:amd64 (2:1.3.7-1) ...Setting up libffi-dev:amd64 (3.4.4-1) ...Setting up libunwind8:amd64 (1.6.2-3) ...Setting up python3-markupsafe (2.1.2-1+b1) ...Setting up libpthread-stubs0-dev:amd64 (0.4-1) ...Setting up libmpcdec6:amd64 (2:0.1~r495-2) ...Setting up libjbig0:amd64 (2.1-6.1) ...Setting up librav1e0:amd64 (0.5.1-6) ...Setting up libpcre2-16-0:amd64 (10.42-1+deb12u2) ...Setting up libcolord2:amd64 (1.4.6-2.2) ...Setting up libopengl0:amd64 (1.6.0-1) ...Setting up libpsl-dev:amd64 (0.21.2-1) ...Setting up libsnappy1v5:amd64 (1.1.9-3) ...Setting up poppler-data (0.4.12-1) ...Setting up libxcb-xkb1:amd64 (1.15-1) ...Setting up libvo-aacenc0:amd64 (0.1.3-2) ...Setting up libxcb-present0:amd64 (1.15-1) ...Setting up libdconf1:amd64 (0.40.0-4) ...Setting up xtrans-dev (1.4.0-1) ...Setting up libgraphite2-dev:amd64 (1.3.14-1+deb12u1) ...Setting up libfontenc1:amd64 (1:1.1.4-1) ...Setting up python3-pygments (2.14.0+dfsg-1) ...Setting up libz3-4:amd64 (4.8.12-3.1) ...Setting up libpcre2-32-0:amd64 (10.42-1+deb12u2) ...Setting up libblas3:amd64 (3.11.0-2) ...update-alternatives: using /usr/lib/x86_64-linux-gnu/blas/libblas.so.3 to provide /usr/lib/x86_64-linux-gnu/libblas.so.3 (libblas.so.3-x86_64-linux-gnu) in auto modeSetting up libsoundtouch1:amd64 (2.3.2+ds1-1) ...Setting up libzxing2:amd64 (1.4.0-3+b1) ...Setting up libglib2.0-data (2.74.6-2+deb12u9) ...Setting up libpkgconf3:amd64 (1.8.1-1) ...Setting up libflac12:amd64 (1.4.2+ds-2) ...Setting up libgles2:amd64 (1.6.0-1) ...Setting up libexpat1-dev:amd64 (2.5.0-1+deb12u5) ...Setting up libdvdread8:amd64 (6.1.3-1) ...Setting up emacsen-common (3.0.5) ...Setting up libslang2:amd64 (2.3.3-3) ...Setting up libva2:amd64 (2.17.0-1) ...Setting up libsqlite3-dev:amd64 (3.40.1-2+deb12u2) ...Setting up libmbedcrypto7:amd64 (2.28.3-1) ...Setting up libx11-data (2:1.8.4-2+deb12u2) ...Setting up libjpeg62-turbo-dev:amd64 (1:2.1.5-2) ...Setting up libepoxy0:amd64 (1.5.10-1) ...Setting up libspa-0.2-modules:amd64 (0.3.65-3+deb12u1) ...Setting up libjavascriptcoregtk-6.0-1:amd64 (2.50.6-1~deb12u2) ...Setting up libxcb-sync1:amd64 (1.15-1) ...Setting up libjbig2dec0:amd64 (0.19-3+deb12u1) ...Setting up uuid-dev:amd64 (2.38.1-5+deb12u3) ...Setting up libncurses6:amd64 (6.4-4) ...Setting up libgles1:amd64 (1.6.0-1) ...Setting up xz-utils (5.4.1-1+deb12u2) ...Setting up xfonts-encodings (1:1.0.4-2.2) ...Setting up libopenexr-3-1-30:amd64 (3.1.5-5) ...Setting up libfribidi0:amd64 (1.0.8-2.1) ...Setting up libpipewire-0.3-0:amd64 (0.3.65-3+deb12u1) ...Setting up libopus0:amd64 (1.3.1-3) ...Setting up libfaad2:amd64 (2.10.1-1) ...Setting up intel-media-va-driver:amd64 (23.1.1+dfsg1-1) ...Setting up libpng16-16:amd64 (1.6.39-2+deb12u6) ...Setting up systemd-timesyncd (252.39-1~deb12u2) ...Creating group 'systemd-timesync' with GID 997. Creating user 'systemd-timesync' (systemd Time Synchronization) with UID 997 and GID 997. Created symlink /etc/systemd/system/dbus-org.freedesktop.timesync1.service → /lib/systemd/system/systemd-timesyncd.service. Created symlink /etc/systemd/system/sysinit.target.wants/systemd-timesyncd.service → /lib/systemd/system/systemd-timesyncd.service. Setting up libvorbis0a:amd64 (1.3.7-1) ...Setting up libidn12:amd64 (1.41-1) ...Setting up python3-markdown (3.4.1-2+deb12u1) ...Setting up liborc-0.4-0:amd64 (1:0.4.33-2) ...Setting up icu-devtools (72.1-3+deb12u1) ...Setting up libgav1-1:amd64 (0.18.0-1+b1) ...Setting up libsepol-dev:amd64 (3.4-2.1) ...Setting up ucf (3.0043+nmu1+deb12u1) ...debconf: unable to initialize frontend: Dialogdebconf: (No usable dialog-like program is installed, so the dialog based frontend cannot be used. at /usr/share/perl5/Debconf/FrontEnd/Dialog.pm line 78.)debconf: falling back to frontend: Readlinedebconf: unable to initialize frontend: Readlinedebconf: (This frontend requires a controlling tty.)debconf: falling back to frontend: TeletypeSetting up pkgconf-bin (1.8.1-1) ...Setting up libsensors5:amd64 (1:3.6.0-7.1) ...Setting up liblerc-dev:amd64 (4.0.0+ds-2) ...Setting up libaacs0:amd64 (0.11.1-2) ...Setting up libjxl0.7:amd64 (0.7.0-10+deb12u1) ...Setting up libfuse3-3:amd64 (3.14.0-4) ...Setting up pocketsphinx-en-us (0.8+5prealpha+1-15) ...Setting up libdav1d6:amd64 (1.0.0-2+deb12u1) ...Setting up libltdl7:amd64 (2.4.7-7~deb12u1) ...Setting up libfftw3-double3:amd64 (3.3.10-1) ...Setting up libglapi-mesa:amd64 (22.3.6-1+deb12u2) ...Setting up libgfortran5:amd64 (12.2.0-14+deb12u1) ...Setting up libvulkan1:amd64 (1.3.239.0-1) ...Setting up libopenh264-7:amd64 (2.3.1+dfsg-3+deb12u2) ...Setting up libltc11:amd64 (1.3.2-1) ...Setting up libsoup2.4-common (2.74.3-1+deb12u1) ...Setting up libwebp7:amd64 (1.2.4-0.2+deb12u1) ...Setting up librubberband2:amd64 (3.1.2+dfsg0-1) ...Setting up liblzma-dev:amd64 (5.4.1-1+deb12u2) ...Setting up libsndio7.0:amd64 (1.9.0-0.3+b2) ...Setting up libxcb-dri2-0:amd64 (1.15-1) ...Setting up zlib1g-dev:amd64 (1:1.2.13.dfsg-1) ...Setting up xdg-dbus-proxy (0.1.4-3+deb12u2) ...Setting up libbdplus0:amd64 (0.2.0-3) ...Setting up libnuma1:amd64 (2.0.16-1) ...Setting up libpcre2-posix3:amd64 (10.42-1+deb12u2) ...Setting up libvidstab1.1:amd64 (1.1.0-2+b1) ...Setting up libsrt1.5-gnutls:amd64 (1.5.1-1+deb12u1) ...Setting up wayland-protocols (1.31-1) ...Setting up libtag1v5:amd64 (1.13-2+deb12u1) ...Setting up libflite1:amd64 (2.2-5) ...Setting up liblqr-1-0:amd64 (0.4.2-2.1) ...Setting up libdv4:amd64 (1.0.0-15) ...Setting up ocl-icd-libopencl1:amd64 (2.3.1-1) ...Setting up libasyncns0:amd64 (0.8-6+b3) ...Setting up libwildmidi2:amd64 (0.4.3-1) ...Setting up libxshmfence1:amd64 (1.3-1) ...Setting up at-spi2-common (2.46.0-5) ...Setting up libwavpack1:amd64 (5.6.0-1) ...Setting up libtiff6:amd64 (4.5.0-6+deb12u4) ...Setting up libbs2b0:amd64 (3.1.0+dfsg-7) ...Setting up libxcb-randr0:amd64 (1.15-1) ...Setting up dbus-session-bus-common (1.14.10-1~deb12u1) ...Setting up libv4lconvert0:amd64 (1.22.1-5+b2) ...Setting up libdca0:amd64 (0.0.7-2) ...Setting up libharfbuzz-subset0:amd64 (6.0.0+dfsg-3) ...Setting up libzimg2:amd64 (3.0.4+ds1-1) ...Setting up libopenjp2-7:amd64 (2.5.0-2+deb12u3) ...Setting up libx11-6:amd64 (2:1.8.4-2+deb12u2) ...Setting up libopenal-data (1:1.19.1-2) ...Setting up libthai-data (0.1.29-1) ...Setting up libgirepository-1.0-1:amd64 (1.74.0-3) ...Setting up xorg-sgml-doctools (1:1.11-1.1) ...Setting up libjson-glib-1.0-common (1.6.6-1) ...Setting up libvpx7:amd64 (1.12.0-1+deb12u5) ...Setting up libatk1.0-0:amd64 (2.46.0-5) ...Setting up fonts-droid-fallback (1:6.0.1r16-1.1) ...Setting up libwayland-egl1:amd64 (1.21.0-1) ...Setting up libusb-1.0-0:amd64 (2:1.0.26-1) ...Setting up libdjvulibre-text (3.5.28-2.2~deb12u1) ...Setting up libopengl-dev:amd64 (1.6.0-1) ...Setting up libhunspell-1.7-0:amd64 (1.7.1-1) ...Setting up glib-networking-common (2.74.0-4) ...Setting up dbus-system-bus-common (1.14.10-1~deb12u1) ...Setting up libmfx1:amd64 (22.5.4-1) ...Setting up libde265-0:amd64 (1.0.11-1+deb12u3) ...Setting up libsamplerate0:amd64 (0.2.2-3) ...Setting up timgm6mb-soundfont (1.3-5) ...update-alternatives: using /usr/share/sounds/sf2/TimGM6mb.sf2 to provide /usr/share/sounds/sf2/default-GM.sf2 (default-GM.sf2) in auto modeupdate-alternatives: using /usr/share/sounds/sf2/TimGM6mb.sf2 to provide /usr/share/sounds/sf3/default-GM.sf3 (default-GM.sf3) in auto modeSetting up libwebpmux3:amd64 (1.2.4-0.2+deb12u1) ...Setting up libtiffxx6:amd64 (4.5.0-6+deb12u4) ...Setting up python3-lib2to3 (3.11.2-3) ...Setting up libdeflate-dev:amd64 (1.14-1) ...Setting up libdrm-common (2.4.114-1) ...Setting up libyuv0:amd64 (0.0~git20230123.b2528b0-1) ...Setting up libxcomposite1:amd64 (1:0.4.5-1) ...Setting up libevdev2:amd64 (1.13.0+dfsg-1) ...Setting up libicu-dev:amd64 (72.1-3+deb12u1) ...Setting up libxml2:amd64 (2.9.14+dfsg-1.3~deb12u6) ...Setting up libmjpegutils-2.1-0:amd64 (1:2.1.0+debian-7) ...Setting up iso-codes (4.15.0-1) ...Setting up dbus-bin (1.14.10-1~deb12u1) ...Setting up libbrotli-dev:amd64 (1.0.9-2+deb12u1) ...Setting up libgudev-1.0-0:amd64 (237-2) ...Setting up libpolkit-gobject-1-0:amd64 (122-3) ...Setting up libzvbi-common (0.2.41-1+deb12u1) ...Setting up libsecret-common (0.20.5-3) ...Setting up libgstreamer1.0-0:amd64 (1.22.0-2+deb12u1) ...Setcap worked! gst-ptp-helper is not suid!Setting up libmp3lame0:amd64 (3.100-6) ...Setting up libgraphene-1.0-0:amd64 (1.10.8-1) ...Setting up python3-mako (1.2.4+ds-1) ...Setting up libvorbisenc2:amd64 (1.3.7-1) ...Setting up libdvdnav4:amd64 (6.1.1-1) ...Setting up libaa1:amd64 (1.4p5-50) ...Setting up libiec61883-0:amd64 (1.2.0-6+b1) ...Setting up libserd-0-0:amd64 (0.30.16-1) ...Setting up libxkbcommon0:amd64 (1.5.0-1) ...Setting up libwayland-client0:amd64 (1.21.0-1) ...Setting up python3-distutils (3.11.2-3) ...Setting up x11proto-dev (2022.1-1) ...Setting up libavc1394-0:amd64 (0.5.4-5) ...Setting up libxcb-dri3-0:amd64 (1.15-1) ...Setting up libglib2.0-dev-bin (2.74.6-2+deb12u9) ...Setting up glib-networking-services (2.74.0-4) ...Setting up libzvbi0:amd64 (0.2.41-1+deb12u1) ...Setting up libblkid-dev:amd64 (2.38.1-5+deb12u3) ...Setting up libpaper1:amd64 (1.1.29) ...debconf: unable to initialize frontend: Dialogdebconf: (No usable dialog-like program is installed, so the dialog based frontend cannot be used. at /usr/share/perl5/Debconf/FrontEnd/Dialog.pm line 78.)debconf: falling back to frontend: Readlinedebconf: unable to initialize frontend: Readlinedebconf: (This frontend requires a controlling tty.)debconf: falling back to frontend: TeletypeCreating config file /etc/papersize with new versionSetting up libx11-xcb1:amd64 (2:1.8.4-2+deb12u2) ...Setting up libice6:amd64 (2:1.0.10-1) ...Setting up liblapack3:amd64 (3.11.0-2) ...update-alternatives: using /usr/lib/x86_64-linux-gnu/lapack/liblapack.so.3 to provide /usr/lib/x86_64-linux-gnu/liblapack.so.3 (liblapack.so.3-x86_64-linux-gnu) in auto modeSetting up libvulkan-dev:amd64 (1.3.239.0-1) ...Setting up libharfbuzz-icu0:amd64 (6.0.0+dfsg-3) ...Setting up libxdamage1:amd64 (1:1.1.6-1) ...Setting up libopenni2-0:amd64 (2.2.0.33+dfsg-15+b1) ...Setting up libplacebo208:amd64 (4.208.0-3) ...Setting up libzmq5:amd64 (4.3.4-6) ...Setting up libxau-dev:amd64 (1:1.0.9-1) ...Setting up libjxr-tools (1.2~git20170615.f752187-5) ...Setting up libcaca0:amd64 (0.99.beta20-3+deb12u1) ...Setting up libavif15:amd64 (0.11.1-1+deb12u1) ...Setting up libpcre2-dev:amd64 (10.42-1+deb12u2) ...Setting up libwoff1:amd64 (1.0.2-2) ...Setting up libxrender1:amd64 (1:0.9.10-1.1) ...Setting up libice-dev:amd64 (2:1.0.10-1) ...Setting up dictionaries-common (1.29.5) ...debconf: unable to initialize frontend: Dialogdebconf: (No usable dialog-like program is installed, so the dialog based frontend cannot be used. at /usr/share/perl5/Debconf/FrontEnd/Dialog.pm line 78.)debconf: falling back to frontend: Readlinedebconf: unable to initialize frontend: Readlinedebconf: (This frontend requires a controlling tty.)debconf: falling back to frontend: TeletypeSetting up libpng-tools (1.6.39-2+deb12u6) ...Setting up libselinux1-dev:amd64 (3.4-1+b6) ...Setting up libfribidi-dev:amd64 (1.0.8-2.1) ...Setting up libwebpdemux2:amd64 (1.2.4-0.2+deb12u1) ...Setting up libmanette-0.2-0:amd64 (0.2.6-3+b1) ...Setting up libxkbcommon-dev:amd64 (1.5.0-1) ...Setting up libpng-dev:amd64 (1.6.39-2+deb12u6) ...Setting up libdjvulibre21:amd64 (3.5.28-2.2~deb12u1) ...Setting up libjpeg-dev:amd64 (1:2.1.5-2) ...Setting up libjbig-dev:amd64 (2.1-6.1) ...Setting up libxext6:amd64 (2:1.3.4-1+b1) ...Setting up gobject-introspection (1.74.0-3) ...Setting up libglib2.0-bin (2.74.6-2+deb12u9) ...Setting up libgstreamer-plugins-base1.0-0:amd64 (1.22.0-3+deb12u7) ...Setting up libopenal1:amd64 (1:1.19.1-2) ...Setting up dbus-daemon (1.14.10-1~deb12u1) ...Setting up libpaper-utils (1.1.29) ...Setting up xfonts-utils (1:7.7+6) ...Setting up libcairo2:amd64 (1.16.0-7) ...Setting up libspandsp2:amd64 (0.0.6+dfsg-2+b1) ...Setting up pkgconf:amd64 (1.8.1-1) ...Setting up libjson-glib-1.0-0:amd64 (1.6.6-1) ...Setting up libxxf86vm1:amd64 (1:1.1.4-1+b2) ...Setting up libfreetype-dev:amd64 (2.12.1+dfsg-5+deb12u4) ...Setting up fuse3 (3.14.0-4) ...Setting up librist4:amd64 (0.2.7+dfsg-1) ...Setting up libv4l-0:amd64 (1.22.1-5+b2) ...Setting up libthai0:amd64 (0.1.29-1) ...Setting up libvorbisfile3:amd64 (1.3.7-1) ...Setting up libxdmcp-dev:amd64 (1:1.1.2-3) ...Setting up libwayland-bin (1.21.0-1) ...Setting up libsecret-1-0:amd64 (0.20.5-3) ...Setting up libwebp-dev:amd64 (1.2.4-0.2+deb12u1) ...Setting up libass9:amd64 (1:0.17.1-1+deb12u1) ...Setting up libtiff-dev:amd64 (4.5.0-6+deb12u4) ...Setting up libxfixes3:amd64 (1:6.0.0-2) ...Setting up x11proto-core-dev (2022.1-1) ...Setting up dbus (1.14.10-1~deb12u1) ...invoke-rc.d: could not determine current runlevelinvoke-rc.d: policy-rc.d denied execution of start.Setting up shared-mime-info (2.2-1) ...Setting up libxinerama1:amd64 (2:1.1.4-3) ...Setting up libxkbcommon-x11-0:amd64 (1.5.0-1) ...Setting up libdc1394-25:amd64 (2.2.6-4) ...Setting up libxv1:amd64 (2:1.0.11-1.1) ...Setting up libxrandr2:amd64 (2:1.5.2-2+b1) ...Setting up pkg-config:amd64 (1.8.1-1) ...Setting up libmpeg2encpp-2.1-0:amd64 (1:2.1.0+debian-7) ...Setting up gir1.2-glib-2.0:amd64 (1.74.0-3) ...Setting up aspell (0.60.8-4+b1) ...Setting up libx265-199:amd64 (3.5-2+b1) ...Setting up libjack-jackd2-0:amd64 (1.9.21~dfsg-3) ...Setting up libdrm2:amd64 (2.4.114-1+b1) ...Setting up libdatrie-dev:amd64 (0.2.13-2+b1) ...Setting up libva-drm2:amd64 (2.17.0-1) ...Setting up libneon27:amd64 (0.32.5-1) ...Setting up libvdpau1:amd64 (1.5-2) ...Setting up libsord-0-0:amd64 (0.16.14+git221008-1) ...Setting up libwayland-cursor0:amd64 (1.21.0-1) ...Setting up libsratom-0-0:amd64 (0.6.14-1) ...Setting up libllvm15:amd64 (1:15.0.6-4+b1) ...Setting up libtheora0:amd64 (1.1.1+dfsg.1-16.1+deb12u1) ...Setting up libxslt1.1:amd64 (1.1.35-1+deb12u4) ...Setting up hunspell-en-us (1:2020.12.07-2) ...Setting up libpam-systemd:amd64 (252.39-1~deb12u2) ...debconf: unable to initialize frontend: Dialogdebconf: (No usable dialog-like program is installed, so the dialog based frontend cannot be used. at /usr/share/perl5/Debconf/FrontEnd/Dialog.pm line 78.)debconf: falling back to frontend: Readlinedebconf: unable to initialize frontend: Readlinedebconf: (This frontend requires a controlling tty.)debconf: falling back to frontend: TeletypeSetting up libdecor-0-0:amd64 (0.1.1-2) ...Setting up libpolkit-agent-1-0:amd64 (122-3) ...Setting up gir1.2-json-1.0:amd64 (1.6.6-1) ...Setting up libgdk-pixbuf-2.0-0:amd64 (2.42.10+dfsg-1+deb12u4) ...Setting up libcairo-gobject2:amd64 (1.16.0-7) ...Setting up libmplex2-2.1-0:amd64 (1:2.1.0+debian-7) ...Setting up libxss1:amd64 (1:1.2.3-1) ...Setting up libsndfile1:amd64 (1.2.0-1+deb12u1) ...Setting up libsysprof-4:amd64 (3.46.0-4) ...Setting up libbluray2:amd64 (1:1.3.4-1) ...Setting up libva-x11-2:amd64 (2.17.0-1) ...Setting up libsm6:amd64 (2:1.2.3-1) ...Setting up liblilv-0-0:amd64 (0.24.14-1) ...Setting up libopenmpt0:amd64 (0.6.9-1) ...Setting up libinstpatch-1.0-2:amd64 (1.1.6-1) ...Setting up libmount-dev:amd64 (2.38.1-5+deb12u3) ...Setting up libdrm-amdgpu1:amd64 (2.4.114-1+b1) ...Setting up gir1.2-graphene-1.0:amd64 (1.10.8-1) ...Setting up libcairo-script-interpreter2:amd64 (1.16.0-7) ...Setting up mesa-vulkan-drivers:amd64 (22.3.6-1+deb12u2) ...Setting up gtk-update-icon-cache (3.24.38-2~deb12u3) ...Setting up libnghttp2-dev:amd64 (1.52.0-1+deb12u3) ...Setting up libxft2:amd64 (2.3.6-1) ...Setting up libdrm-nouveau2:amd64 (2.4.114-1+b1) ...Setting up gir1.2-freedesktop:amd64 (1.74.0-3) ...Setting up libxcb1-dev:amd64 (1.15-1) ...Setting up libxi6:amd64 (2:1.8-1+b1) ...Setting up gir1.2-gdkpixbuf-2.0:amd64 (2.42.10+dfsg-1+deb12u4) ...Setting up libgbm1:amd64 (22.3.6-1+deb12u2) ...Setting up libpulse0:amd64 (16.1+dfsg1-2+b1) ...Setting up libenchant-2-2:amd64 (2.3.3-2) ...Setting up libfontconfig-dev:amd64 (2.14.1-4) ...Setting up libzbar0:amd64 (0.23.92-7+deb12u1) ...Setting up libsm-dev:amd64 (2:1.2.3-1) ...Setting up libdrm-radeon1:amd64 (2.4.114-1+b1) ...Setting up libxtst6:amd64 (2:1.2.3-1.1) ...Setting up libxcursor1:amd64 (1:1.2.1-1) ...Setting up libpango-1.0-0:amd64 (1.50.12+ds-1) ...Setting up libdrm-intel1:amd64 (2.4.114-1+b1) ...Setting up libgl1-mesa-dri:amd64 (22.3.6-1+deb12u2) ...Setting up libheif1:amd64 (1.15.1-1+deb12u1) ...Setting up libraptor2-0:amd64 (2.0.15-4+deb12u1) ...Setting up aspell-en (2020.12.07-0-1) ...Setting up libx11-dev:amd64 (2:1.8.4-2+deb12u2) ...Setting up enchant-2 (2.3.3-2) ...Setting up gir1.2-javascriptcoregtk-6.0:amd64 (2.50.6-1~deb12u2) ...Setting up libatspi2.0-0:amd64 (2.46.0-5) ...Setting up fonts-urw-base35 (20200910-7) ...Setting up libwayland-dev:amd64 (1.21.0-1) ...Setting up gir1.2-harfbuzz-0.0:amd64 (6.0.0+dfsg-3) ...Setting up libxfixes-dev:amd64 (1:6.0.0-2) ...Setting up libatk-bridge2.0-0:amd64 (2.46.0-5) ...Setting up libxcb-shm0-dev:amd64 (1.15-1) ...Setting up dbus-user-session (1.14.10-1~deb12u1) ...Setting up libavutil57:amd64 (7:5.1.9-0+deb12u1) ...Setting up libmagickcore-6.q16-6:amd64 (8:6.9.11.60+dfsg-1.6+deb12u14) ...Setting up libegl-mesa0:amd64 (22.3.6-1+deb12u2) ...Setting up gstreamer1.0-plugins-base:amd64 (1.22.0-3+deb12u7) ...Setting up libglib2.0-dev:amd64 (2.74.6-2+deb12u9) ...Setting up adwaita-icon-theme (43-1) ...update-alternatives: using /usr/share/icons/Adwaita/cursor.theme to provide /usr/share/icons/default/index.theme (x-cursor-theme) in auto modeSetting up libswresample4:amd64 (7:5.1.9-0+deb12u1) ...Setting up gsfonts (2:20200910-7) ...Setting up libshout3:amd64 (2.4.6-1+b1) ...Setting up libxcb-render0-dev:amd64 (1.15-1) ...Setting up libxt6:amd64 (1:1.2.1-1.1) ...Setting up libxext-dev:amd64 (2:1.3.4-1+b1) ...Setting up libthai-dev:amd64 (0.1.29-1) ...Setting up libgdk-pixbuf2.0-bin (2.42.10+dfsg-1+deb12u4) ...Setting up gir1.2-polkit-1.0 (122-3) ...Setting up libegl1:amd64 (1.6.0-1) ...Setting up libmagickwand-6.q16-6:amd64 (8:6.9.11.60+dfsg-1.6+deb12u14) ...Setting up libpostproc56:amd64 (7:5.1.9-0+deb12u1) ...Setting up mesa-va-drivers:amd64 (22.3.6-1+deb12u2) ...Setting up libpangoft2-1.0-0:amd64 (1.50.12+ds-1) ...Setting up libxi-dev:amd64 (2:1.8-1+b1) ...Setting up libsdl2-2.0-0:amd64 (2.26.5+dfsg-1) ...Setting up libswscale6:amd64 (7:5.1.9-0+deb12u1) ...Setting up libxrender-dev:amd64 (1:0.9.10-1.1) ...Setting up i965-va-driver:amd64 (2.4.1+dfsg1-1) ...Setting up libfluidsynth3:amd64 (2.3.1-2) ...Setting up libpangocairo-1.0-0:amd64 (1.50.12+ds-1) ...Setting up libxft-dev:amd64 (2.3.6-1) ...Setting up libxdamage-dev:amd64 (1:1.1.6-1) ...Setting up libgs10-common (10.0.0~dfsg-11+deb12u8) ...Setting up mesa-vdpau-drivers:amd64 (22.3.6-1+deb12u2) ...Setting up libglx-mesa0:amd64 (22.3.6-1+deb12u2) ...Setting up gstreamer1.0-x:amd64 (1.22.0-3+deb12u7) ...Setting up xdg-desktop-portal (1.16.0-2) ...Created symlink /etc/systemd/user/graphical-session-pre.target.wants/xdg-desktop-portal-rewrite-launchers.service → /usr/lib/systemd/user/xdg-desktop-portal-rewrite-launchers.service. Setting up libpangoxft-1.0-0:amd64 (1.50.12+ds-1) ...Setting up libglx0:amd64 (1.6.0-1) ...Setting up libmagickcore-6.q16-6-extra:amd64 (8:6.9.11.60+dfsg-1.6+deb12u14) ...Setting up libsphinxbase3:amd64 (0.8+5prealpha+1-16) ...Setting up libxcomposite-dev:amd64 (1:0.4.5-1) ...Setting up liblrdf0:amd64 (0.6.1-4) ...Setting up libxcursor-dev:amd64 (1:1.2.1-1) ...Setting up pango1.0-tools (1.50.12+ds-1) ...Setting up dconf-service (0.40.0-4) ...Setting up librsvg2-2:amd64 (2.54.7+dfsg-1~deb12u1) ...Setting up libpocketsphinx3:amd64 (0.8+5prealpha+1-15) ...Setting up gir1.2-pango-1.0:amd64 (1.50.12+ds-1) ...Setting up libxrandr-dev:amd64 (2:1.5.2-2+b1) ...Setting up libgl1:amd64 (1.6.0-1) ...Setting up va-driver-all:amd64 (2.17.0-1) ...Setting up libdecor-0-plugin-1-cairo:amd64 (0.1.1-2) ...Setting up libxinerama-dev:amd64 (2:1.1.4-3) ...Setting up librsvg2-common:amd64 (2.54.7+dfsg-1~deb12u1) ...Setting up libglx-dev:amd64 (1.6.0-1) ...Setting up libavcodec59:amd64 (7:5.1.9-0+deb12u1) ...Setting up libdirectfb-1.7-7:amd64 (1.7.7-11) ...Setting up libvdpau-va-gl1:amd64 (0.4.2-1+b1) ...Setting up libgl-dev:amd64 (1.6.0-1) ...Setting up libgs10:amd64 (10.0.0~dfsg-11+deb12u8) ...Setting up libchromaprint1:amd64 (1.5.1-2+b1) ...Setting up libavformat59:amd64 (7:5.1.9-0+deb12u1) ...Setting up dconf-gsettings-backend:amd64 (0.40.0-4) ...Setting up libegl-dev:amd64 (1.6.0-1) ...Setting up libepoxy-dev:amd64 (1.5.10-1) ...Setting up ghostscript (10.0.0~dfsg-11+deb12u8) ...Setting up libavfilter8:amd64 (7:5.1.9-0+deb12u1) ...Setting up libgstreamer-gl1.0-0:amd64 (1.22.0-3+deb12u7) ...Setting up vdpau-driver-all:amd64 (1.5-2) ...Setting up libgtk-4-common (4.8.3+ds-2+deb12u1) ...Setting up libgles-dev:amd64 (1.6.0-1) ...Setting up gstreamer1.0-libav:amd64 (1.22.0-2) ...Setting up libgtk-3-common (3.24.38-2~deb12u3) ...Setting up gstreamer1.0-gl:amd64 (1.22.0-3+deb12u7) ...Setting up gsettings-desktop-schemas (43.0-1) ...Setting up libglvnd-dev:amd64 (1.6.0-1) ...Setting up libegl1-mesa-dev:amd64 (22.3.6-1+deb12u2) ...Processing triggers for libglib2.0-0:amd64 (2.74.6-2+deb12u9) ...Setting up libgtk-3-0:amd64 (3.24.38-2~deb12u3) ...Setting up libjson-glib-dev:amd64 (1.6.6-1) ...Processing triggers for libc-bin (2.36-9+deb12u14) ...Setting up libgtk-3-bin (3.24.38-2~deb12u3) ...Setting up libgirepository1.0-dev (1.74.0-3) ...Setting up libpolkit-gobject-1-dev (122-3) ...Setting up libjavascriptcoregtk-6.0-dev:amd64 (2.50.6-1~deb12u2) ...Setting up at-spi2-core (2.46.0-5) ...Setting up libgraphene-1.0-dev (1.10.8-1) ...Setting up libgtk-4-1:amd64 (4.8.3+ds-2+deb12u1) ...Setting up libgtk-4-bin (4.8.3+ds-2+deb12u1) ...Setting up libcairo2-dev:amd64 (1.16.0-7) ...Setting up glib-networking:amd64 (2.74.0-4) ...Setting up gir1.2-gtk-4.0:amd64 (4.8.3+ds-2+deb12u1) ...Setting up libgdk-pixbuf-2.0-dev:amd64 (2.42.10+dfsg-1+deb12u4) ...Setting up xdg-desktop-portal-gtk (1.14.1-1) ...Setting up libharfbuzz-dev:amd64 (6.0.0+dfsg-3) ...Setting up libsoup2.4-1:amd64 (2.74.3-1+deb12u1) ...Setting up gstreamer1.0-plugins-good:amd64 (1.22.0-5+deb12u4) ...Setting up libsoup-3.0-0:amd64 (3.2.3-0+deb12u2) ...Setting up libadwaita-1-0:amd64 (1.2.2-1) ...Setting up libgssdp-1.6-0:amd64 (1.6.2-2) ...Setting up libpango1.0-dev:amd64 (1.50.12+ds-1) ...Setting up gir1.2-soup-3.0:amd64 (3.2.3-0+deb12u2) ...Setting up libsysprof-ui-5:amd64 (3.46.0-4) ...Setting up libwebkitgtk-6.0-4:amd64 (2.50.6-1~deb12u2) ...Setting up libgtk-4-dev:amd64 (4.8.3+ds-2+deb12u1) ...Setting up libgupnp-1.6-0:amd64 (1.6.3-1) ...Setting up gir1.2-adw-1:amd64 (1.2.2-1) ...Setting up libgupnp-igd-1.0-4:amd64 (1.2.0-3) ...Setting up libnice10:amd64 (0.1.21-1) ...Setting up gir1.2-webkit-6.0:amd64 (2.50.6-1~deb12u2) ...Setting up libadwaita-1-dev:amd64 (1.2.2-1) ...Setting up libgstreamer-plugins-bad1.0-0:amd64 (1.22.0-4+deb12u8) ...Setting up gstreamer1.0-plugins-bad:amd64 (1.22.0-4+deb12u8) ...Setting up libsysprof-4-dev:amd64 (3.46.0-4) ...Setting up libsoup-3.0-dev:amd64 (3.2.3-0+deb12u2) ...Setting up libwebkitgtk-6.0-dev (2.50.6-1~deb12u2) ...Processing triggers for dictionaries-common (1.29.5) ...debconf: unable to initialize frontend: Dialogdebconf: (No usable dialog-like program is installed, so the dialog based frontend cannot be used. at /usr/share/perl5/Debconf/FrontEnd/Dialog.pm line 78.)debconf: falling back to frontend: Readlinedebconf: unable to initialize frontend: Readlinedebconf: (This frontend requires a controlling tty.)debconf: falling back to frontend: Teletypeaspell-autobuildhash: processing: en [en-common].aspell-autobuildhash: processing: en [en-variant_0].aspell-autobuildhash: processing: en [en-variant_1].aspell-autobuildhash: processing: en [en-variant_2].aspell-autobuildhash: processing: en [en-w_accents-only].aspell-autobuildhash: processing: en [en-wo_accents-only].aspell-autobuildhash: processing: en [en_AU-variant_0].aspell-autobuildhash: processing: en [en_AU-variant_1].aspell-autobuildhash: processing: en [en_AU-w_accents-only].aspell-autobuildhash: processing: en [en_AU-wo_accents-only].aspell-autobuildhash: processing: en [en_CA-variant_0].aspell-autobuildhash: processing: en [en_CA-variant_1].aspell-autobuildhash: processing: en [en_CA-w_accents-only].aspell-autobuildhash: processing: en [en_CA-wo_accents-only].aspell-autobuildhash: processing: en [en_GB-ise-w_accents-only].aspell-autobuildhash: processing: en [en_GB-ise-wo_accents-only].aspell-autobuildhash: processing: en [en_GB-ize-w_accents-only].aspell-autobuildhash: processing: en [en_GB-ize-wo_accents-only].aspell-autobuildhash: processing: en [en_GB-variant_0].aspell-autobuildhash: processing: en [en_GB-variant_1].aspell-autobuildhash: processing: en [en_US-w_accents-only].aspell-autobuildhash: processing: en [en_US-wo_accents-only].Processing triggers for libgdk-pixbuf-2.0-0:amd64 (2.42.10+dfsg-1+deb12u4) ...Processing triggers for libc-bin (2.36-9+deb12u14) ...
successInstall the Wails CLI 38s
Run
go install github.com/wailsapp/wails/v3/cmd/wails3@v3.0.0
echo "$(go env GOPATH)/bin" >> "$GITHUB_PATH"
go: downloading github.com/wailsapp/wails/v3 v3.0.0go: downloading github.com/pterm/pterm v0.12.82go: downloading github.com/leaanthony/clir v1.7.0go: downloading github.com/ProtonMail/go-crypto v1.3.0go: downloading github.com/atterpac/refresh v1.1.4go: downloading github.com/charmbracelet/huh v0.8.0go: downloading github.com/jackmordaunt/icns/v2 v2.2.7go: downloading github.com/konoui/lipo v0.10.0go: downloading github.com/leaanthony/dmg v0.0.0-20260731074841-5c28840cf819go: downloading github.com/leaanthony/winicon v1.0.0go: downloading github.com/modelcontextprotocol/go-sdk v1.6.1go: downloading github.com/tc-hib/winres v0.3.1go: downloading github.com/wailsapp/task/v3 v3.40.1-patched3go: downloading golang.org/x/image v0.45.0go: downloading golang.org/x/mod v0.41.0go: downloading gopkg.in/yaml.v3 v3.0.1go: downloading howett.net/plist v1.0.2-0.20250314012144-ee69052608d9go: downloading github.com/charmbracelet/lipgloss v1.1.1-0.20250404203927-76690c660834go: downloading github.com/muesli/termenv v0.16.0go: downloading golang.org/x/term v0.46.0go: downloading atomicgo.dev/cursor v0.2.0go: downloading atomicgo.dev/keyboard v0.2.9go: downloading atomicgo.dev/schedule v0.1.0go: downloading github.com/gookit/color v1.6.0go: downloading github.com/lithammer/fuzzysearch v1.1.8go: downloading github.com/mattn/go-runewidth v0.0.19go: downloading golang.org/x/text v0.42.0go: downloading golang.org/x/crypto v0.57.0go: downloading github.com/BurntSushi/toml v1.6.0go: downloading github.com/lmittmann/tint v1.1.3go: downloading github.com/rjeczalik/notify v0.9.3go: downloading gopkg.in/yaml.v2 v2.4.0go: downloading github.com/nfnt/resize v0.0.0-20180221191011-83c6a9932646go: downloading github.com/catppuccin/go v0.3.0go: downloading github.com/charmbracelet/bubbles v0.21.1-0.20250623103423-23b8fd6302d7go: downloading github.com/charmbracelet/bubbletea v1.3.10go: downloading github.com/charmbracelet/x/cellbuf v0.0.14go: downloading github.com/charmbracelet/x/exp/strings v0.0.0-20260122224438-b01af16209d9go: downloading github.com/mitchellh/hashstructure/v2 v2.0.2go: downloading golang.org/x/sys v0.48.0go: downloading golang.org/x/oauth2 v0.35.0go: downloading github.com/google/jsonschema-go v0.4.3go: downloading github.com/yosida95/uritemplate/v3 v3.0.2go: downloading github.com/Ladicle/tabwriter v1.0.0go: downloading github.com/Masterminds/semver/v3 v3.4.0go: downloading github.com/joho/godotenv v1.5.1go: downloading github.com/radovskyb/watcher v1.0.7go: downloading github.com/sajari/fuzzy v1.0.0go: downloading golang.org/x/sync v0.23.0go: downloading mvdan.cc/sh/v3 v3.12.0go: downloading github.com/dominikbraun/graph v0.23.0go: downloading github.com/jaypipes/ghw v0.21.3go: downloading github.com/charmbracelet/glamour v0.10.0go: downloading golang.org/x/tools v0.49.0go: downloading github.com/zalando/go-keyring v0.2.6go: downloading github.com/goreleaser/nfpm/v2 v2.44.1go: downloading github.com/atotto/clipboard v0.1.4go: downloading github.com/charmbracelet/x/ansi v0.11.4go: downloading github.com/rivo/uniseg v0.4.7go: downloading github.com/aymanbagabas/go-osc52/v2 v2.0.1go: downloading github.com/lucasb-eyer/go-colorful v1.3.0go: downloading github.com/mattn/go-isatty v0.0.20go: downloading github.com/containerd/console v1.0.5go: downloading github.com/xo/terminfo v0.0.0-20220910002029-abceb7e1c41ego: downloading github.com/clipperhouse/uax29/v2 v2.4.0go: downloading github.com/cloudflare/circl v1.6.3go: downloading github.com/dustin/go-humanize v1.0.1go: downloading github.com/charmbracelet/x/term v0.2.2go: downloading github.com/charmbracelet/colorprofile v0.4.1go: downloading github.com/muesli/ansi v0.0.0-20230316100256-276c6243b2f6go: downloading github.com/muesli/cancelreader v0.2.2go: downloading github.com/konoui/go-qsort v0.1.0go: downloading github.com/segmentio/encoding v0.5.4go: downloading github.com/alecthomas/chroma/v2 v2.23.1go: downloading github.com/fatih/color v1.18.0go: downloading github.com/mattn/go-zglob v0.0.6go: downloading github.com/zeebo/xxh3 v1.1.0go: downloading github.com/davecgh/go-spew v1.1.1go: downloading github.com/go-task/slim-sprig/v3 v3.0.0go: downloading github.com/go-task/template v0.2.0go: downloading github.com/chainguard-dev/git-urls v1.0.2go: downloading github.com/go-git/go-billy/v5 v5.9.0go: downloading github.com/go-git/go-git/v5 v5.19.2go: downloading github.com/spf13/pflag v1.0.10go: downloading github.com/yuin/goldmark v1.7.17go: downloading github.com/yuin/goldmark-emoji v1.0.6go: downloading golang.org/x/exp/typeparams v0.0.0-20260112195511-716be5621a96go: downloading golang.org/x/exp v0.0.0-20260410095643-746e56fc9e2fgo: downloading github.com/godbus/dbus/v5 v5.2.2go: downloading dario.cat/mergo v1.0.2go: downloading github.com/AlekSi/pointer v1.2.0go: downloading github.com/goreleaser/chglog v0.7.4go: downloading go.yaml.in/yaml/v3 v3.0.4go: downloading github.com/klauspost/pgzip v1.2.6go: downloading github.com/klauspost/compress v1.18.7go: downloading github.com/blakesmith/ar v0.0.0-20190502131153-809d4375e1fbgo: downloading github.com/ulikunitz/xz v0.5.15go: downloading github.com/google/rpmpack v0.7.1go: downloading github.com/clipperhouse/displaywidth v0.7.0go: downloading github.com/clipperhouse/stringish v0.1.1go: downloading github.com/dlclark/regexp2 v1.11.5go: downloading github.com/mattn/go-colorable v0.1.14go: downloading github.com/klauspost/cpuid/v2 v2.3.0go: downloading github.com/sergi/go-diff v1.4.0go: downloading github.com/charmbracelet/x/exp/slice v0.0.0-20260122224438-b01af16209d9go: downloading github.com/microcosm-cc/bluemonday v1.0.27go: downloading github.com/muesli/reflow v0.3.0go: downloading github.com/jaypipes/pcidb v1.1.1go: downloading github.com/Masterminds/sprig/v3 v3.3.0go: downloading gitlab.com/digitalxero/go-conventional-commit v1.0.7go: downloading github.com/segmentio/asm v1.1.3go: downloading github.com/cavaliergopher/cpio v1.0.1go: downloading github.com/cyphar/filepath-securejoin v0.6.1go: downloading github.com/go-git/gcfg v1.5.1-0.20230307220236-3a3c6141e376go: downloading github.com/pjbgf/sha1cd v0.6.0go: downloading github.com/emirpasic/gods v1.18.1go: downloading github.com/jbenet/go-context v0.0.0-20150711004518-d14ea06fba99go: downloading github.com/aymerick/douceur v0.2.0go: downloading golang.org/x/net v0.60.0go: downloading github.com/Masterminds/goutils v1.1.1go: downloading github.com/google/uuid v1.6.0go: downloading github.com/huandu/xstrings v1.5.0go: downloading github.com/mitchellh/copystructure v1.2.0go: downloading github.com/shopspring/decimal v1.4.0go: downloading github.com/spf13/cast v1.10.0go: downloading github.com/goreleaser/fileglob v1.4.0go: downloading gopkg.in/warnings.v0 v0.1.2go: downloading github.com/golang/groupcache v0.0.0-20241129210726-2c02b8208cf8go: downloading github.com/kevinburke/ssh_config v1.4.0go: downloading github.com/skeema/knownhosts v1.3.2go: downloading github.com/xanzy/ssh-agent v0.3.3go: downloading github.com/gorilla/css v1.0.1go: downloading github.com/mitchellh/reflectwalk v1.0.2go: downloading github.com/gobwas/glob v0.2.3
successBindings are up to date 9s
Run
make bindings-check
Wails v3.0.0 › Generate Bindings WARNING [warn] -: # github.com/wailsapp/wails/v3/pkg/application /tmp/home/go/pkg/mod/github.com/wailsapp/wails/v3@v3.0.0/pkg/application/linux_cgo.go:1975:5: could not determine what C.add_file_filter refers to /tmp/home/go/pkg/mod/github.com/wailsapp/wails/v3@v3.0.0/pkg/application/linux_cgo.go:785:25: could not determine what C.gdk_monitor_get_scale refers to /tmp/home/go/pkg/mod/github.com/wailsapp/wails/v3@v3.0.0/pkg/application/linux_cgo.go:1412:5: could not determine what C.gtk_css_provider_load_from_string refers to /tmp/home/go/pkg/mod/github.com/wailsapp/wails/v3@v3.0.0/pkg/application/linux_cgo.go:1998:4: could not determine what C.gtk_file_dialog_set_accept_label refers to /tmp/home/go/pkg/mod/github.com/wailsapp/wails/v3@v3.0.0/pkg/application/linux_cgo.go:1991:4: could not determine what C.gtk_file_dialog_set_initial_folder refers to /tmp/home/go/pkg/mod/github.com/wailsapp/wails/v3@v3.0.0/pkg/application/linux_cgo.go:1984:4: could not determine what C.gtk_file_dialog_set_initial_name refers to /tmp/home/go/pkg/mod/github.com/wailsapp/wails/v3@v3.0.0/pkg/application/linux_cgo.go:1979:4: could not determine what C.set_file_dialog_filters refers to /tmp/home/go/pkg/mod/github.com/wailsapp/wails/v3@v3.0.0/pkg/application/linux_cgo.go:2013:4: could not determine what C.show_open_file_dialog refers to /tmp/home/go/pkg/mod/github.com/wailsapp/wails/v3@v3.0.0/pkg/application/linux_cgo.go:2011:4: could not determine what C.show_save_file_dialog refers to cgo: gcc errors for preamble: In file included from /tmp/home/go/pkg/mod/github.com/wailsapp/wails/v3@v3.0.0/pkg/application/linux_cgo.go:19: ./linux_cgo.h:177:1: error: unknown type name 'GtkFileDialog'; did you mean 'GtkNativeDialog'? 177 | GtkFileDialog* create_file_dialog(const char *title); | ^~~~~~~~~~~~~ | GtkNativeDialog ./linux_cgo.h:178:22: error: unknown type name 'GtkFileDialog'; did you mean 'GtkNativeDialog'? 178 | void add_file_filter(GtkFileDialog *dialog, GListStore *filters, const char *name, const char *pattern); | ^~~~~~~~~~~~~ | GtkNativeDialog ./linux_cgo.h:179:30: error: unknown type name 'GtkFileDialog'; did you mean 'GtkNativeDialog'? 179 | void set_file_dialog_filters(GtkFileDialog *dialog, GListStore *filters); | ^~~~~~~~~~~~~ | GtkNativeDialog ./linux_cgo.h:180:47: error: unknown type name 'GtkFileDialog'; did you mean 'GtkNativeDialog'? 180 | void show_open_file_dialog(GtkWindow *parent, GtkFileDialog *dialog, guint request_id, gboolean allow_multiple, gboolean is_folder); | ^~~~~~~~~~~~~ | GtkNativeDialog ./linux_cgo.h:181:47: error: unknown type name 'GtkFileDialog'; did you mean 'GtkNativeDialog'? 181 | void show_save_file_dialog(GtkWindow *parent, GtkFileDialog *dialog, guint request_id); | ^~~~~~~~~~~~~ | GtkNativeDialog WARNING [warn] /tmp/home/go/pkg/mod/github.com/wailsapp/wails/v3@v3.0.0/pkg/application/application_linux.go:15:8: could not import C (no metadata for C) WARNING [warn] /tmp/home/go/pkg/mod/github.com/wailsapp/wails/v3@v3.0.0/pkg/application/application_linux.go:195:28: cannot convert window (variable of Pointer type pointer) to type windowPointer WARNING [warn] /tmp/home/go/pkg/mod/github.com/wailsapp/wails/v3@v3.0.0/pkg/application/linux_cgo.go:866:56: cannot convert w.window (variable of Pointer type pointer) to type windowPointer INFO Processed: 270 Packages, 2 Services, 6 Methods, 1 Enum, 6 Models, 3 Events in 8.519979014s. INFO Output directory: /workspace/sidekicks/frontend/bindings WARNING 4 warnings emitted
failureLint and tests 45s
Run
make check
? Verifying lockfile against supply-chain policies (95 entries)...Packages are hard linked from the content-addressable store to the virtual store. Content-addressable store is at: /workspace/.pnpm-store/v11 Virtual store is at: node_modules/.pnpmDownloading @rolldown/binding-linux-x64-gnu@1.2.15: 0.00 B/8.30 MBDownloading @rolldown/binding-darwin-x64@1.2.15: 0.00 B/7.90 MBDownloading @rolldown/binding-darwin-arm64@1.2.15: 0.00 B/7.53 MBDownloading @rolldown/binding-linux-arm64-gnu@1.2.15: 0.00 B/7.84 MB✓ Lockfile passes supply-chain policies (95 entries in 781ms)Lockfile is up to date, resolution step is skippedPackages: +77+++++++++++++++++++++++++++++++++++++++++++++++++++++++++++++++++++++++++++++Progress: resolved 77, reused 0, downloaded 77, added 77, donedependencies:+ @wailsio/runtime 3.0.0+ paneforge 1.0.2devDependencies:+ @sveltejs/vite-plugin-svelte 7.3.1+ @tsconfig/svelte 5.0.8+ svelte 5.57.3+ svelte-check 4.7.7+ tslib 2.8.1+ typescript 5.9.3+ vite 8.3.5+ vitest 5.0.4Done in 811ms using pnpm v12.11.2$ vite build --mode productionvite v8.3.5 building client environment for production...transforming...✓ 336 modules transformed.rendering chunks...computing gzip size...dist/index.html 0.49 kB │ gzip: 0.35 kBdist/assets/index-BYSm1FoM.css 5.91 kB │ gzip: 1.76 kBdist/assets/index-DxLdoRKw.js 115.48 kB │ gzip: 40.36 kB✓ built in 335msgo: downloading github.com/golangci/golangci-lint/v2 v2.14.0go: downloading charm.land/lipgloss/v2 v2.0.6go: downloading github.com/fatih/color v1.19.0go: downloading github.com/gofrs/flock v0.13.1go: downloading github.com/ldez/grignotin v0.10.1go: downloading github.com/pelletier/go-toml/v2 v2.4.3go: downloading github.com/spf13/cobra v1.10.2go: downloading github.com/pelletier/go-toml v1.9.5go: downloading github.com/spf13/viper v1.12.0go: downloading github.com/mattn/go-colorable v0.1.15go: downloading github.com/mattn/go-isatty v0.0.22go: downloading github.com/charmbracelet/colorprofile v0.4.3go: downloading github.com/charmbracelet/ultraviolet v0.0.0-20260811164956-006e29f97886go: downloading github.com/charmbracelet/x/ansi v0.11.8go: downloading github.com/clipperhouse/displaywidth v0.11.0go: downloading github.com/lucasb-eyer/go-colorful v1.4.1go: downloading golang.org/x/tools v0.50.0go: downloading github.com/go-viper/mapstructure/v2 v2.5.0go: downloading github.com/hashicorp/go-version v1.9.0go: downloading github.com/mitchellh/go-homedir v1.1.0go: downloading github.com/alecthomas/chroma/v2 v2.27.0go: downloading github.com/rogpeppe/go-internal v1.16.0go: downloading github.com/golangci/plugin-module-register v0.1.2go: downloading github.com/sirupsen/logrus v1.10.2go: downloading github.com/stretchr/testify v1.12.1go: downloading github.com/go-xmlfmt/xmlfmt v1.1.3go: downloading github.com/golangci/revgrep v0.8.0go: downloading golang.org/x/text v0.41.0go: downloading github.com/fsnotify/fsnotify v1.9.0go: downloading github.com/mitchellh/mapstructure v1.5.0go: downloading github.com/spf13/afero v1.15.0go: downloading github.com/spf13/cast v1.5.0go: downloading github.com/spf13/jwalterweatherman v1.1.0go: downloading github.com/xo/terminfo v1.0.0go: downloading github.com/charmbracelet/x/termios v0.1.1go: downloading github.com/charmbracelet/x/windows v0.2.2go: downloading github.com/clipperhouse/uax29/v2 v2.7.0go: downloading github.com/mattn/go-runewidth v0.0.24go: downloading github.com/daixiang0/gci v0.13.7go: downloading github.com/golangci/gofmt v0.0.0-20260820135601-e84e05053792go: downloading mvdan.cc/gofumpt v0.12.0go: downloading github.com/golangci/golines v0.15.0go: downloading github.com/sourcegraph/go-diff v0.9.0go: downloading github.com/golangci/swaggoswag v0.0.0-20250504205917-77f2aca3143ego: downloading go.augendre.info/arangolint v0.4.0go: downloading github.com/alingse/asasalint v0.0.11go: downloading github.com/golangci/asciicheck v0.5.0go: downloading github.com/breml/bidichk v0.3.3go: downloading github.com/timakin/bodyclose v0.0.0-20260723120731-857993a2939cgo: downloading github.com/golangci/canonicalheader v0.0.0-20260827115959-a25c71c521f6go: downloading github.com/ClickHouse/clickhouse-go-linter v1.2.1go: downloading github.com/sivchari/containedctx v1.0.3go: downloading github.com/kkHAIKE/contextcheck v1.1.6go: downloading github.com/karamaru-alpha/copyloopvar v1.2.2go: downloading github.com/bkielbasa/cyclop v1.2.3go: downloading gitlab.com/bosi/decorder v0.4.2go: downloading github.com/OpenPeeDeeP/depguard/v2 v2.2.1go: downloading github.com/golangci/dupl v0.0.0-20260401084720-c99c5cf5c202go: downloading github.com/Abirdcfly/dupword v0.1.8go: downloading github.com/charithe/durationcheck v0.0.11go: downloading github.com/manuelarte/embeddedstructfieldcheck v0.4.0go: downloading github.com/Djarvur/go-err113 v0.1.1go: downloading github.com/kisielk/errcheck v1.20.0go: downloading github.com/breml/errchkjson v0.4.1go: downloading github.com/Antonboom/errname v1.1.2go: downloading codeberg.org/polyfloyd/go-errorlint v1.9.0go: downloading github.com/nishanths/exhaustive v0.13.0go: downloading dev.gaijin.team/go/exhaustruct/v4 v4.0.0go: downloading dev.gaijin.team/go/exhaustruct/v5 v5.2.0go: downloading github.com/ldez/exptostd v0.4.5go: downloading go.augendre.info/fatcontext v0.10.1go: downloading github.com/ashanbrown/forbidigo/v2 v2.3.1go: downloading github.com/gostaticanalysis/forcetypeassert v0.2.0go: downloading github.com/manuelarte/funcorder v0.6.0go: downloading github.com/ultraware/funlen v0.2.0go: downloading github.com/nunnatsa/ginkgolinter v0.24.0go: downloading 4d63.com/gocheckcompilerdirectives v1.4.0go: downloading 4d63.com/gochecknoglobals v0.2.2go: downloading github.com/alecthomas/go-check-sumtype v0.5.1-0.20260828200218-ae6904d28606go: downloading github.com/uudashr/gocognit v1.2.1go: downloading github.com/jgautheron/goconst v1.11.0go: downloading github.com/go-critic/go-critic v0.15.0go: downloading github.com/quasilyte/go-ruleguard/dsl v0.3.23go: downloading github.com/fzipp/gocyclo v0.6.0go: downloading github.com/quasilyte/go-ruleguard v0.4.5go: downloading github.com/godoc-lint/godoc-lint v0.11.4go: downloading github.com/tetafro/godot v1.5.6go: downloading github.com/matoous/godox v1.1.0go: downloading github.com/denis-tingaikin/go-header v0.5.0go: downloading github.com/ldez/gomoddirectives v0.10.0go: downloading github.com/Masterminds/semver/v3 v3.5.0go: downloading github.com/ryancurrah/gomodguard v1.4.1go: downloading github.com/ryancurrah/gomodguard/v2 v2.1.3go: downloading github.com/golangci/go-printf-func-name v0.1.1go: downloading github.com/securego/gosec/v2 v2.29.0go: downloading github.com/xen0n/gosmopolitan v1.3.0go: downloading github.com/leonklingele/grouper v1.1.2go: downloading github.com/uudashr/iface v1.5.1go: downloading github.com/julz/importas v0.2.0go: downloading github.com/macabu/inamedparam v0.2.0go: downloading github.com/gordonklaus/ineffassign v0.2.0go: downloading github.com/sashamelentyev/interfacebloat v1.1.0go: downloading github.com/ckaznocha/intrange v0.3.1go: downloading github.com/AdminBenni/iota-mixing v1.0.0go: downloading github.com/butuzov/ireturn v0.4.1go: downloading github.com/timonwong/loggercheck v0.12.0go: downloading github.com/yagipy/maintidx v1.0.0go: downloading github.com/ashanbrown/makezero/v2 v2.2.1go: downloading github.com/butuzov/mirror v1.3.3go: downloading github.com/golangci/misspell v0.8.0go: downloading github.com/tommy-muehle/go-mnd/v2 v2.5.1go: downloading go-simpler.org/musttag v0.14.0go: downloading github.com/alexkohler/nakedret/v2 v2.0.6go: downloading github.com/nakabonne/nestif v0.3.1go: downloading github.com/gostaticanalysis/nilerr v0.1.2go: downloading github.com/alingse/nilnesserr v0.2.0go: downloading github.com/Antonboom/nilnil v1.1.2go: downloading github.com/ssgreg/nlreturn/v2 v2.2.1go: downloading github.com/sonatard/noctx v0.5.1go: downloading github.com/AlwxSin/noinlineerr v1.0.6go: downloading github.com/firefart/nonamedreturns v1.0.8go: downloading github.com/stbenjam/no-sprintf-host-port v0.3.1go: downloading github.com/kunwardeep/paralleltest v1.0.15go: downloading github.com/catenacyber/perfsprint v0.10.1go: downloading github.com/alexkohler/prealloc v1.1.0go: downloading github.com/nishanths/predeclared v0.2.2go: downloading github.com/yeya24/promlinter v0.3.0go: downloading github.com/ghostiam/protogetter v1.0.1go: downloading github.com/curioswitch/go-reassign v0.3.0go: downloading github.com/raeperd/recvcheck v0.3.1go: downloading github.com/mgechev/revive v1.17.0go: downloading github.com/golangci/rowserrcheck v0.0.0-20260419091836-c5f79b8a11bago: downloading go-simpler.org/sloglint v0.12.0go: downloading github.com/jjti/go-spancheck v0.6.5go: downloading github.com/ryanrolds/sqlclosecheck v0.6.0go: downloading honnef.co/go/tools v0.8.1go: downloading github.com/ldez/tagliatelle v0.8.0go: downloading github.com/4meepo/tagalign v1.4.4go: downloading github.com/maratori/testableexamples v1.0.1go: downloading github.com/Antonboom/testifylint v1.6.4go: downloading github.com/maratori/testpackage v1.1.2go: downloading github.com/kulti/thelper v0.7.1go: downloading github.com/moricho/tparallel v0.3.2go: downloading github.com/golangci/unconvert v0.0.0-20250410112200-a129a6e6413ego: downloading mvdan.cc/unparam v0.0.0-20260823230713-2fa3d841b0c8go: downloading github.com/MirrexOne/unqueryvet v1.5.4go: downloading github.com/sashamelentyev/usestdlibvars v1.29.0go: downloading github.com/ldez/usetesting v0.5.0go: downloading github.com/blizzy78/varnamelen v0.8.0go: downloading github.com/sanposhiho/wastedassign/v2 v2.1.0go: downloading github.com/ultraware/whitespace v0.2.0go: downloading github.com/tomarrell/wrapcheck/v2 v2.12.0go: downloading github.com/bombsimon/wsl/v4 v4.7.0go: downloading github.com/bombsimon/wsl/v5 v5.9.0go: downloading github.com/ykadowak/zerologlint v0.1.5go: downloading github.com/stretchr/objx v0.5.3go: downloading github.com/subosito/gotenv v1.4.1go: downloading github.com/hashicorp/hcl v1.0.0go: downloading gopkg.in/ini.v1 v1.67.0go: downloading github.com/magiconair/properties v1.8.6go: downloading go.uber.org/zap v1.27.0go: downloading github.com/hexops/gotextdiff v1.0.3go: downloading github.com/dave/dst v0.27.3go: downloading github.com/gostaticanalysis/analysisutil v0.7.1go: downloading github.com/go-toolsmith/astcast v1.1.0go: downloading dev.gaijin.team/go/golib v0.8.1go: downloading github.com/google/go-cmp v0.7.0go: downloading github.com/go-toolsmith/astfmt v1.1.0go: downloading github.com/go-toolsmith/astcopy v1.1.0go: downloading github.com/go-toolsmith/astequal v1.2.0go: downloading github.com/go-toolsmith/astp v1.1.0go: downloading github.com/go-toolsmith/strparse v1.1.0go: downloading github.com/go-toolsmith/typep v1.1.0go: downloading github.com/quasilyte/regex/syntax v0.0.0-20210819130434-b3f0c404a727go: downloading github.com/ccojocar/zxcvbn-go v1.0.4go: downloading github.com/gostaticanalysis/comment v1.5.0go: downloading github.com/prometheus/client_golang v1.12.1go: downloading github.com/prometheus/client_model v0.2.0go: downloading github.com/fatih/structtag v1.2.0go: downloading github.com/ettle/strcase v0.2.0go: downloading github.com/alfatraining/structtag v1.0.0go: downloading github.com/hashicorp/go-immutable-radix/v2 v2.1.0go: downloading github.com/dlclark/regexp2/v2 v2.2.1go: downloading go.uber.org/multierr v1.10.0go: downloading github.com/ldez/structtags v0.6.1go: downloading golang.org/x/exp/typeparams v0.0.0-20260811152304-ee035b5b010fgo: downloading github.com/quasilyte/gogrep v0.5.0go: downloading github.com/quasilyte/stdinfo v0.0.0-20220114132959-f7386bf02567go: downloading github.com/beorn7/perks v1.0.1go: downloading github.com/cespare/xxhash/v2 v2.3.0go: downloading github.com/golang/protobuf v1.5.3go: downloading github.com/prometheus/common v0.32.1go: downloading github.com/prometheus/procfs v0.7.3go: downloading google.golang.org/protobuf v1.36.12go: downloading codeberg.org/chavacava/garif v0.2.1go: downloading github.com/hashicorp/golang-lru/v2 v2.0.7go: downloading github.com/matttproud/golang_protobuf_extensions v1.0.1main.go:22:2: could not import github.com/wailsapp/wails/v3/pkg/application (-: # github.com/wailsapp/wails/v3/pkg/application/tmp/home/go/pkg/mod/github.com/wailsapp/wails/v3@v3.0.0/pkg/application/linux_cgo.go:1975:5: could not determine what C.add_file_filter refers to/tmp/home/go/pkg/mod/github.com/wailsapp/wails/v3@v3.0.0/pkg/application/linux_cgo.go:785:25: could not determine what C.gdk_monitor_get_scale refers to/tmp/home/go/pkg/mod/github.com/wailsapp/wails/v3@v3.0.0/pkg/application/linux_cgo.go:1412:5: could not determine what C.gtk_css_provider_load_from_string refers to/tmp/home/go/pkg/mod/github.com/wailsapp/wails/v3@v3.0.0/pkg/application/linux_cgo.go:1998:4: could not determine what C.gtk_file_dialog_set_accept_label refers to/tmp/home/go/pkg/mod/github.com/wailsapp/wails/v3@v3.0.0/pkg/application/linux_cgo.go:1991:4: could not determine what C.gtk_file_dialog_set_initial_folder refers to/tmp/home/go/pkg/mod/github.com/wailsapp/wails/v3@v3.0.0/pkg/application/linux_cgo.go:1984:4: could not determine what C.gtk_file_dialog_set_initial_name refers to/tmp/home/go/pkg/mod/github.com/wailsapp/wails/v3@v3.0.0/pkg/application/linux_cgo.go:1979:4: could not determine what C.set_file_dialog_filters refers to/tmp/home/go/pkg/mod/github.com/wailsapp/wails/v3@v3.0.0/pkg/application/linux_cgo.go:2013:4: could not determine what C.show_open_file_dialog refers to/tmp/home/go/pkg/mod/github.com/wailsapp/wails/v3@v3.0.0/pkg/application/linux_cgo.go:2011:4: could not determine what C.show_save_file_dialog refers tocgo: gcc errors for preamble:In file included from /tmp/home/go/pkg/mod/github.com/wailsapp/wails/v3@v3.0.0/pkg/application/linux_cgo.go:19:./linux_cgo.h:177:1: error: unknown type name 'GtkFileDialog'; did you mean 'GtkNativeDialog'? 177 | GtkFileDialog* create_file_dialog(const char *title); | ^~~~~~~~~~~~~ | GtkNativeDialog./linux_cgo.h:178:22: error: unknown type name 'GtkFileDialog'; did you mean 'GtkNativeDialog'? 178 | void add_file_filter(GtkFileDialog *dialog, GListStore *filters, const char *name, const char *pattern); | ^~~~~~~~~~~~~ | GtkNativeDialog./linux_cgo.h:179:30: error: unknown type name 'GtkFileDialog'; did you mean 'GtkNativeDialog'? 179 | void set_file_dialog_filters(GtkFileDialog *dialog, GListStore *filters); | ^~~~~~~~~~~~~ | GtkNativeDialog./linux_cgo.h:180:47: error: unknown type name 'GtkFileDialog'; did you mean 'GtkNativeDialog'? 180 | void show_open_file_dialog(GtkWindow *parent, GtkFileDialog *dialog, guint request_id, gboolean allow_multiple, gboolean is_folder); | ^~~~~~~~~~~~~ | GtkNativeDialog./linux_cgo.h:181:47: error: unknown type name 'GtkFileDialog'; did you mean 'GtkNativeDialog'? 181 | void show_save_file_dialog(GtkWindow *parent, GtkFileDialog *dialog, guint request_id); | ^~~~~~~~~~~~~ | GtkNativeDialog) (typecheck) "github.com/wailsapp/wails/v3/pkg/application" ^1 issues:* typecheck: 1make: *** [Makefile:67: lint-go] Error 1
Post Set up Node
Caching for '' is not supported(node:17868) [DEP0040] DeprecationWarning: The `punycode` module is deprecated. Please use a userland alternative instead.(Use `node --trace-deprecation ...` to show where the warning was created)
Post Set up Go
(node:17877) [DEP0040] DeprecationWarning: The `punycode` module is deprecated. Please use a userland alternative instead.(Use `node --trace-deprecation ...` to show where the warning was created)[command]/tmp/hostedtoolcache/go/1.26.0/x64/bin/go env GOMODCACHE[command]/tmp/hostedtoolcache/go/1.26.0/x64/bin/go env GOCACHE/tmp/home/go/pkg/mod/tmp/home/.cache/go-buildCache service version: v2Checking zstd --quiet --version1.5.4zstd version: 1.5.4implicitDescendants 'false'followSymbolicLinks 'true'implicitDescendants 'false'omitBrokenSymbolicLinks 'true'Search path '/tmp/home/go/pkg/mod'Search path '/tmp/home/.cache/go-build'Matched: ../../tmp/home/go/pkg/modMatched: ../../tmp/home/.cache/go-buildCache Paths:["../../tmp/home/go/pkg/mod","../../tmp/home/.cache/go-build"]Archive Path: /tmp/6237f943-64ad-41fd-bf9f-9fbcd66b544b/cache.tzst[command]/usr/bin/tar --posix -cf cache.tzst --exclude cache.tzst -P -C /workspace/sidekicks --files-from manifest.txt --use-compress-program zstdmtFile Size: 630818870Reserving Cache[Request] CreateCacheEntry http://172.30.255.1:8888/twirp/github.actions.results.api.v1.CacheService/CreateCacheEntry[Response] - 200Headers: { "content-length": "772", "content-security-policy": "default-src 'self'; img-src 'self' data:; style-src 'self'; script-src 'self'; base-uri 'none'; frame-ancestors 'none'; object-src 'none'; form-action 'self' https://payment.stancer.com", "content-type": "application/json", "date": "Thu, 29 Oct 2026 12:14:11 GMT", "permissions-policy": "accelerometer=(), autoplay=(), camera=(), display-capture=(), encrypted-media=(), fullscreen=(self), geolocation=(), gyroscope=(), magnetometer=(), microphone=(), midi=(), payment=(), usb=()", "referrer-policy": "strict-origin-when-cross-origin", "strict-transport-security": "max-age=31536000; includeSubDomains", "x-content-type-options": "nosniff", "x-request-id": "bca234c6-12b8-41ed-acd5-2ab7a912bcb7"}Body: { "ok": true, "signedUploadUrl": "http://172.30.255.1:8888/twirp/_blob/upload?sig=***", "signed_upload_url": "http://172.30.255.1:8888/twirp/_blob/upload?sig=***"}Attempting to upload cache located at: /tmp/6237f943-64ad-41fd-bf9f-9fbcd66b544b/cache.tzstUse Azure SDK: trueUpload concurrency: 8Upload chunk size: 67108864BlobClient: upload:twirp:_blobSent 0 of 630818870 (0.0%), 0.0 MBs/secSent 0 of 630818870 (0.0%), 0.0 MBs/secSent 0 of 630818870 (0.0%), 0.0 MBs/secSent 0 of 630818870 (0.0%), 0.0 MBs/secSent 0 of 630818870 (0.0%), 0.0 MBs/secSent 0 of 630818870 (0.0%), 0.0 MBs/secSent 0 of 630818870 (0.0%), 0.0 MBs/secSent 0 of 630818870 (0.0%), 0.0 MBs/secSent 0 of 630818870 (0.0%), 0.0 MBs/secSent 0 of 630818870 (0.0%), 0.0 MBs/secSent 0 of 630818870 (0.0%), 0.0 MBs/secSent 0 of 630818870 (0.0%), 0.0 MBs/secSent 0 of 630818870 (0.0%), 0.0 MBs/secSent 0 of 630818870 (0.0%), 0.0 MBs/secSent 0 of 630818870 (0.0%), 0.0 MBs/secSent 0 of 630818870 (0.0%), 0.0 MBs/secSent 0 of 630818870 (0.0%), 0.0 MBs/secSent 0 of 630818870 (0.0%), 0.0 MBs/secSent 0 of 630818870 (0.0%), 0.0 MBs/secSent 0 of 630818870 (0.0%), 0.0 MBs/secSent 0 of 630818870 (0.0%), 0.0 MBs/secSent 0 of 630818870 (0.0%), 0.0 MBs/secSent 0 of 630818870 (0.0%), 0.0 MBs/secSent 67108864 of 630818870 (10.6%), 2.7 MBs/secSent 134217728 of 630818870 (21.3%), 5.1 MBs/secSent 201326592 of 630818870 (31.9%), 7.4 MBs/secSent 201326592 of 630818870 (31.9%), 7.1 MBs/secSent 201326592 of 630818870 (31.9%), 6.9 MBs/secSent 201326592 of 630818870 (31.9%), 6.6 MBs/secSent 268435456 of 630818870 (42.6%), 8.5 MBs/secSent 268435456 of 630818870 (42.6%), 8.3 MBs/secSent 268435456 of 630818870 (42.6%), 8.0 MBs/secSent 362383414 of 630818870 (57.4%), 10.5 MBs/secSent 362383414 of 630818870 (57.4%), 10.2 MBs/secSent 429492278 of 630818870 (68.1%), 11.7 MBs/secSent 429492278 of 630818870 (68.1%), 11.4 MBs/secSent 429492278 of 630818870 (68.1%), 11.1 MBs/secSent 429492278 of 630818870 (68.1%), 10.8 MBs/secSent 429492278 of 630818870 (68.1%), 10.5 MBs/secSent 429492278 of 630818870 (68.1%), 10.2 MBs/secSent 429492278 of 630818870 (68.1%), 10.0 MBs/secSent 496601142 of 630818870 (78.7%), 11.3 MBs/secSent 630818870 of 630818870 (100.0%), 14.0 MBs/secuploadCacheArchiveSDK: internal error uploading cache archive: upstream unavailableFailed to save: upstream unavailablestep failed: exit code 2 — Lint and tests
Annotations
uploadCacheArchiveSDK: internal error uploading cache archive: upstream unavailableFailed to save: upstream unavailable

No test reports for this run.

Tell a job where its test runner writes its report and this tab fills in: how many tests passed, failed and were skipped, a bar of the result at a glance, then every failure first — with the assertion that failed and the output around it — over a per-suite list of cases and their durations. No scrolling a log for the word FAIL.

It is one reports: key on the job — a job key, not a step, so the report is collected whatever the job concluded. JUnit XML and go test -json are both understood, and most runners already emit one of them. reports: is a rickub extension and works only in .rickub/workflows/; in .github/workflows/ it is a parse error on purpose, because those files are also meant to run on github.com.